Ask Your Question

Revision history [back]

click to hide/show revision 1
initial version

opencv 2.4.4 compile failed on Mountain Lion and CUDA 5.0

I would appreciate any help regarding this compilation error of opencv 2.4.4. on my late 2009 Mac Book Pro running Mountain Lion 10.8.3., Cuda 5.0.36 and Cudadriver 5.0.45

Thank you

$ cmake -G "Unix Makefiles" -D CMAKE_CXX_COMPILER=/usr/bin/g++ -D CMAKE_C_COMPILER=/usr/bin/gcc -D WITH_CUDA=ON MAKE_INSTALL_PREFIX=/usr/local/Cellar/opencv/2.4.4 ../ -- The CXX compiler identification is GNU 4.2.1 -- The C compiler identification is GNU 4.2.1 -- Checking whether CXX compiler has -isysroot -- Checking whether CXX compiler has -isysroot - yes -- Checking whether CXX compiler supports OSX deployment target flag -- Checking whether CXX compiler supports OSX deployment target flag - yes -- Check for working CXX compiler: /usr/bin/g++ -- Check for working CXX compiler: /usr/bin/g++ -- works -- Detecting CXX compiler ABI info -- Detecting CXX compiler ABI info - done -- Checking whether C compiler has -isysroot -- Checking whether C compiler has -isysroot - yes -- Checking whether C compiler supports OSX deployment target flag -- Checking whether C compiler supports OSX deployment target flag - yes -- Check for working C compiler: /usr/bin/gcc -- Check for working C compiler: /usr/bin/gcc -- works -- Detecting C compiler ABI info -- Detecting C compiler ABI info - done -- Detected version of GNU GCC: 42 (402) -- Performing Test HAVE_CXX_W -- Performing Test HAVE_CXX_W - Success -- Performing Test HAVE_C_W -- Performing Test HAVE_C_W - Success -- Performing Test HAVE_CXX_WALL -- Performing Test HAVE_CXX_WALL - Success -- Performing Test HAVE_C_WALL -- Performing Test HAVE_C_WALL - Success -- Performing Test HAVE_CXX_WERROR_RETURN_TYPE -- Performing Test HAVE_CXX_WERROR_RETURN_TYPE - Success -- Performing Test HAVE_C_WERROR_RETURN_TYPE -- Performing Test HAVE_C_WERROR_RETURN_TYPE - Success -- Performing Test HAVE_CXX_WERROR_NON_VIRTUAL_DTOR -- Performing Test HAVE_CXX_WERROR_NON_VIRTUAL_DTOR - Success -- Performing Test HAVE_C_WERROR_NON_VIRTUAL_DTOR -- Performing Test HAVE_C_WERROR_NON_VIRTUAL_DTOR - Success -- Performing Test HAVE_CXX_WERROR_ADDRESS -- Performing Test HAVE_CXX_WERROR_ADDRESS - Success -- Performing Test HAVE_C_WERROR_ADDRESS -- Performing Test HAVE_C_WERROR_ADDRESS - Success -- Performing Test HAVE_CXX_WERROR_SEQUENCE_POINT -- Performing Test HAVE_CXX_WERROR_SEQUENCE_POINT - Success -- Performing Test HAVE_C_WERROR_SEQUENCE_POINT -- Performing Test HAVE_C_WERROR_SEQUENCE_POINT - Success -- Performing Test HAVE_CXX_WFORMAT -- Performing Test HAVE_CXX_WFORMAT - Success -- Performing Test HAVE_C_WFORMAT -- Performing Test HAVE_C_WFORMAT - Success -- Performing Test HAVE_CXX_WERROR_FORMAT_SECURITY -- Performing Test HAVE_CXX_WERROR_FORMAT_SECURITY - Success -- Performing Test HAVE_C_WERROR_FORMAT_SECURITY -- Performing Test HAVE_C_WERROR_FORMAT_SECURITY - Success -- Performing Test HAVE_CXX_WMISSING_DECLARATIONS -- Performing Test HAVE_CXX_WMISSING_DECLARATIONS - Failed -- Performing Test HAVE_C_WMISSING_DECLARATIONS -- Performing Test HAVE_C_WMISSING_DECLARATIONS - Success -- Performing Test HAVE_CXX_WMISSING_PROTOTYPES -- Performing Test HAVE_CXX_WMISSING_PROTOTYPES - Success -- Performing Test HAVE_C_WMISSING_PROTOTYPES -- Performing Test HAVE_C_WMISSING_PROTOTYPES - Success -- Performing Test HAVE_CXX_WSTRICT_PROTOTYPES -- Performing Test HAVE_CXX_WSTRICT_PROTOTYPES - Failed -- Performing Test HAVE_C_WSTRICT_PROTOTYPES -- Performing Test HAVE_C_WSTRICT_PROTOTYPES - Success -- Performing Test HAVE_CXX_WUNDEF -- Performing Test HAVE_CXX_WUNDEF - Success -- Performing Test HAVE_C_WUNDEF -- Performing Test HAVE_C_WUNDEF - Success -- Performing Test HAVE_CXX_WINIT_SELF -- Performing Test HAVE_CXX_WINIT_SELF - Success -- Performing Test HAVE_C_WINIT_SELF -- Performing Test HAVE_C_WINIT_SELF - Success -- Performing Test HAVE_CXX_WPOINTER_ARITH -- Performing Test HAVE_CXX_WPOINTER_ARITH - Success -- Performing Test HAVE_C_WPOINTER_ARITH -- Performing Test HAVE_C_WPOINTER_ARITH - Success -- Performing Test HAVE_CXX_WSHADOW -- Performing Test HAVE_CXX_WSHADOW - Success -- Performing Test HAVE_C_WSHADOW -- Performing Test HAVE_C_WSHADOW - Success -- Performing Test HAVE_CXX_WSIGN_PROMO -- Performing Test HAVE_CXX_WSIGN_PROMO - Success -- Performing Test HAVE_C_WSIGN_PROMO -- Performing Test HAVE_C_WSIGN_PROMO - Failed -- Performing Test HAVE_CXX_WNO_NARROWING -- Performing Test HAVE_CXX_WNO_NARROWING - Failed -- Performing Test HAVE_C_WNO_NARROWING -- Performing Test HAVE_C_WNO_NARROWING - Failed -- Performing Test HAVE_CXX_WNO_DELETE_NON_VIRTUAL_DTOR -- Performing Test HAVE_CXX_WNO_DELETE_NON_VIRTUAL_DTOR - Failed -- Performing Test HAVE_C_WNO_DELETE_NON_VIRTUAL_DTOR -- Performing Test HAVE_C_WNO_DELETE_NON_VIRTUAL_DTOR - Failed -- Performing Test HAVE_CXX_WNO_UNNAMED_TYPE_TEMPLATE_ARGS -- Performing Test HAVE_CXX_WNO_UNNAMED_TYPE_TEMPLATE_ARGS - Failed -- Performing Test HAVE_C_WNO_UNNAMED_TYPE_TEMPLATE_ARGS -- Performing Test HAVE_C_WNO_UNNAMED_TYPE_TEMPLATE_ARGS - Failed -- Performing Test HAVE_CXX_FDIAGNOSTICS_SHOW_OPTION -- Performing Test HAVE_CXX_FDIAGNOSTICS_SHOW_OPTION - Success -- Performing Test HAVE_C_FDIAGNOSTICS_SHOW_OPTION -- Performing Test HAVE_C_FDIAGNOSTICS_SHOW_OPTION - Success -- Performing Test HAVE_CXX_PTHREAD -- Performing Test HAVE_CXX_PTHREAD - Success -- Performing Test HAVE_C_PTHREAD -- Performing Test HAVE_C_PTHREAD - Success -- Performing Test HAVE_CXX_FOMIT_FRAME_POINTER -- Performing Test HAVE_CXX_FOMIT_FRAME_POINTER - Success -- Performing Test HAVE_C_FOMIT_FRAME_POINTER -- Performing Test HAVE_C_FOMIT_FRAME_POINTER - Success -- Performing Test HAVE_CXX_MSSE -- Performing Test HAVE_CXX_MSSE - Success -- Performing Test HAVE_C_MSSE -- Performing Test HAVE_C_MSSE - Success -- Performing Test HAVE_CXX_MSSE2 -- Performing Test HAVE_CXX_MSSE2 - Success -- Performing Test HAVE_C_MSSE2 -- Performing Test HAVE_C_MSSE2 - Success -- Performing Test HAVE_CXX_MSSE3 -- Performing Test HAVE_CXX_MSSE3 - Success -- Performing Test HAVE_C_MSSE3 -- Performing Test HAVE_C_MSSE3 - Success -- Looking for fseeko -- Looking for fseeko - found -- Looking for unistd.h -- Looking for unistd.h - found -- Looking for sys/types.h -- Looking for sys/types.h - found -- Looking for stdint.h -- Looking for stdint.h - found -- Looking for stddef.h -- Looking for stddef.h - found -- Check size of off64_t -- Check size of off64_t - failed -- Performing Test HAVE_C_WNO_ATTRIBUTES -- Performing Test HAVE_C_WNO_ATTRIBUTES - Success -- Performing Test HAVE_C_WNO_STRICT_PROTOTYPES -- Performing Test HAVE_C_WNO_STRICT_PROTOTYPES - Success -- Performing Test HAVE_C_WNO_MISSING_PROTOTYPES -- Performing Test HAVE_C_WNO_MISSING_PROTOTYPES - Success -- Performing Test HAVE_C_WNO_MISSING_DECLARATIONS -- Performing Test HAVE_C_WNO_MISSING_DECLARATIONS - Success -- Looking for assert.h -- Looking for assert.h - found -- Looking for fcntl.h -- Looking for fcntl.h - found -- Looking for io.h -- Looking for io.h - not found -- Looking for jbg_newlen -- Looking for jbg_newlen - not found -- Looking for mmap -- Looking for mmap - found -- Looking for search.h -- Looking for search.h - found -- Looking for string.h -- Looking for string.h - found -- Looking for unistd.h -- Looking for unistd.h - found -- Performing Test HAVE_C_WNO_UNUSED_BUT_SET_VARIABLE -- Performing Test HAVE_C_WNO_UNUSED_BUT_SET_VARIABLE - Failed -- Performing Test HAVE_C_WNO_UNDEF -- Performing Test HAVE_C_WNO_UNDEF - Success -- Performing Test HAVE_C_WNO_UNUSED -- Performing Test HAVE_C_WNO_UNUSED - Success -- Performing Test HAVE_C_WNO_SIGN_COMPARE -- Performing Test HAVE_C_WNO_SIGN_COMPARE - Success -- Performing Test HAVE_C_WNO_CAST_ALIGN -- Performing Test HAVE_C_WNO_CAST_ALIGN - Success -- Performing Test HAVE_C_WNO_SHADOW -- Performing Test HAVE_C_WNO_SHADOW - Success -- Performing Test HAVE_C_WNO_MAYBE_UNINITIALIZED -- Performing Test HAVE_C_WNO_MAYBE_UNINITIALIZED - Failed -- Performing Test HAVE_C_WNO_POINTER_TO_INT_CAST -- Performing Test HAVE_C_WNO_POINTER_TO_INT_CAST - Success -- Performing Test HAVE_C_WNO_INT_TO_POINTER_CAST -- Performing Test HAVE_C_WNO_INT_TO_POINTER_CAST - Success -- Performing Test HAVE_C_WNO_UNUSED_PARAMETER -- Performing Test HAVE_C_WNO_UNUSED_PARAMETER - Success -- Performing Test HAVE_CXX_WNO_MISSING_DECLARATIONS -- Performing Test HAVE_CXX_WNO_MISSING_DECLARATIONS - Failed -- Performing Test HAVE_CXX_WNO_UNUSED_PARAMETER -- Performing Test HAVE_CXX_WNO_UNUSED_PARAMETER - Success -- Performing Test HAVE_C_WNO_UNUSED_VARIABLE -- Performing Test HAVE_C_WNO_UNUSED_VARIABLE - Success -- Performing Test HAVE_C_WNO_IMPLICIT_FUNCTION_DECLARATION -- Performing Test HAVE_C_WNO_IMPLICIT_FUNCTION_DECLARATION - Success -- Performing Test HAVE_C_WNO_UNINITIALIZED -- Performing Test HAVE_C_WNO_UNINITIALIZED - Success -- Looking for semaphore.h -- Looking for semaphore.h - found -- Performing Test HAVE_CXX_WNO_SHADOW -- Performing Test HAVE_CXX_WNO_SHADOW - Success -- Performing Test HAVE_CXX_WNO_UNUSED -- Performing Test HAVE_CXX_WNO_UNUSED - Success -- Performing Test HAVE_CXX_WNO_SIGN_COMPARE -- Performing Test HAVE_CXX_WNO_SIGN_COMPARE - Success -- Performing Test HAVE_CXX_WNO_UNDEF -- Performing Test HAVE_CXX_WNO_UNDEF - Success -- Performing Test HAVE_CXX_WNO_UNINITIALIZED -- Performing Test HAVE_CXX_WNO_UNINITIALIZED - Success -- Performing Test HAVE_CXX_WNO_SWITCH -- Performing Test HAVE_CXX_WNO_SWITCH - Success -- Performing Test HAVE_CXX_WNO_PARENTHESES -- Performing Test HAVE_CXX_WNO_PARENTHESES - Success -- Performing Test HAVE_CXX_WNO_ARRAY_BOUNDS -- Performing Test HAVE_CXX_WNO_ARRAY_BOUNDS - Failed -- Performing Test HAVE_CXX_WNO_EXTRA -- Performing Test HAVE_CXX_WNO_EXTRA - Success -- checking for module 'gstreamer-base-1.0' -- package 'gstreamer-base-1.0' not found -- checking for module 'gstreamer-video-1.0' -- package 'gstreamer-video-1.0' not found -- checking for module 'gstreamer-app-1.0' -- package 'gstreamer-app-1.0' not found -- checking for module 'gstreamer-riff-1.0' -- package 'gstreamer-riff-1.0' not found -- checking for module 'gstreamer-pbutils-1.0' -- package 'gstreamer-pbutils-1.0' not found -- checking for module 'libdc1394-2' -- package 'libdc1394-2' not found -- checking for module 'libdc1394' -- package 'libdc1394' not found -- checking for module 'libv4l1' -- package 'libv4l1' not found -- Looking for linux/videodev.h -- Looking for linux/videodev.h - not found -- Looking for linux/videodev2.h -- Looking for linux/videodev2.h - not found -- Looking for sys/videoio.h -- Looking for sys/videoio.h - not found -- checking for module 'libavcodec' -- found libavcodec, version 54.86.100 -- checking for module 'libavformat' -- found libavformat, version 54.59.106 -- checking for module 'libavutil' -- found libavutil, version 52.13.100 -- checking for module 'libswscale' -- found libswscale, version 2.1.103 -- Looking for libavformat/avformat.h -- Looking for libavformat/avformat.h - found -- Looking for ffmpeg/avformat.h -- Looking for ffmpeg/avformat.h - not found -- CUDA detected: 5.0 -- CUDA NVCC target flags: -gencode;arch=compute_11,code=sm_11;-gencode;arch=compute_12,code=sm_12;-gencode;arch=compute_13,code=sm_13;-gencode;arch=compute_20,code=sm_20;-gencode;arch=compute_20,code=sm_21;-gencode;arch=compute_30,code=sm_30;-gencode;arch=compute_20,code=compute_20;-gencode;arch=compute_30,code=compute_30 -- Found PythonInterp: /usr/local/bin/python2 (found suitable version "2.7.3", minimum required is "2.0") -- Could NOT find PythonLibs: Found unsuitable version "2.7.2", but required is exact version "2.7.3" (found /usr/lib/libpython2.7.dylib) -- Found apache ant 1.8.4: /usr/bin/ant -- Found JNI: -framework JavaVM
-- Performing Test HAVE_CXX_WNO_SIGN_PROMO -- Performing Test HAVE_CXX_WNO_SIGN_PROMO - Success -- Performing Test HAVE_CXX_WNO_MISSING_PROTOTYPES -- Performing Test HAVE_CXX_WNO_MISSING_PROTOTYPES - Success -- Performing Test HAVE_OBJCXX_FOBJC_EXCEPTIONS -- Performing Test HAVE_OBJCXX_FOBJC_EXCEPTIONS - Success -- Performing Test HAVE_CXX_WNO_DEPRECATED_DECLARATIONS

-- Performing Test HAVE_CXX_WNO_DEPRECATED_DECLARATIONS - Success

-- General configuration for OpenCV 2.4.9 =====================================

-- Version control: 2.4.4-868-gf77a375

-- Platform: -- Host: Darwin 12.3.0 i386 -- CMake: 2.8.10.2 -- CMake generator: Unix Makefiles -- CMake build tool: /usr/bin/make

-- Configuration: Release

-- C/C++: -- Built as dynamic libs?: YES -- C++ Compiler: /usr/bin/g++ (ver 4.2.1) -- C++ flags (Release): -W -Wall -Werror=return-type -Werror=non-virtual-dtor -Werror=address -Werror=sequence-point -Wformat -Werror=format-security -Wmissing-prototypes -Wundef -Winit-self -Wpointer-arith -Wshadow -Wsign-promo -fdiagnostics-show-option -pthread -fomit-frame-pointer -msse -msse2 -msse3 -O3 -DNDEBUG -DNDEBUG -- C++ flags (Debug): -W -Wall -Werror=return-type -Werror=non-virtual-dtor -Werror=address -Werror=sequence-point -Wformat -Werror=format-security -Wmissing-prototypes -Wundef -Winit-self -Wpointer-arith -Wshadow -Wsign-promo -fdiagnostics-show-option -pthread -fomit-frame-pointer -msse -msse2 -msse3 -g -O0 -DDEBUG -D_DEBUG -ggdb3 -- C Compiler: /usr/bin/gcc -- C flags (Release): -W -Wall -Werror=return-type -Werror=non-virtual-dtor -Werror=address -Werror=sequence-point -Wformat -Werror=format-security -Wmissing-declarations -Wmissing-prototypes -Wstrict-prototypes -Wundef -Winit-self -Wpointer-arith -Wshadow -fdiagnostics-show-option -pthread -fomit-frame-pointer -msse -msse2 -msse3 -O3 -DNDEBUG -DNDEBUG -- C flags (Debug): -W -Wall -Werror=return-type -Werror=non-virtual-dtor -Werror=address -Werror=sequence-point -Wformat -Werror=format-security -Wmissing-declarations -Wmissing-prototypes -Wstrict-prototypes -Wundef -Winit-self -Wpointer-arith -Wshadow -fdiagnostics-show-option -pthread -fomit-frame-pointer -msse -msse2 -msse3 -g -O0 -DDEBUG -D_DEBUG -ggdb3 -- Linker flags (Release):
-- Linker flags (Debug):

-- Precompiled headers: NO

-- OpenCV modules: -- To be built: core imgproc flann highgui features2d calib3d ml video objdetect contrib photo legacy gpu ocl nonfree java softcascade python stitching superres ts videostab -- Disabled: world -- Disabled by dependency: -

-- Unavailable: androidcamera

-- GUI: -- QT 4.x: NO -- Cocoa: YES

-- OpenGL support: NO

-- Media I/O: -- ZLib: build (ver 1.2.7) -- JPEG: build (ver 90) -- WEBP: build (ver 0.2.1) -- PNG: build (ver 1.5.12) -- TIFF: build (ver 42 - 4.0.2) -- JPEG 2000: build (ver 1.900.1)

-- OpenEXR: build (ver 1.7.1)

-- Video I/O: -- DC1394 1.x: NO -- DC1394 2.x: NO -- FFMPEG: YES -- codec: YES (ver Unknown) -- format: YES (ver Unknown) -- util: YES (ver Unknown) -- swscale: YES (ver Unknown) -- gentoo-style: YES -- OpenNI: NO -- OpenNI PrimeSensor Modules: NO -- PvAPI: NO -- GigEVisionSDK: NO -- QuickTime: NO -- QTKit: YES

-- V4L/V4L2: NO/NO

-- Other third-party libraries: -- Use IPP: NO -- Use Eigen: YES (ver 3.1.2) -- Use TBB: NO -- Use OpenMP: NO -- Use GCD YES -- Use Concurrency NO -- Use C=: NO -- Use Cuda: YES (ver 5.0)

-- Use OpenCL: YES

-- NVIDIA CUDA -- Use CUFFT: YES -- Use CUBLAS: NO -- USE NVCUVID: NO -- NVIDIA GPU arch: 11 12 13 20 21 30 -- NVIDIA PTX archs: 20 30

-- Use fast math: NO

-- OpenCL -- libraries: -framework OpenCL -- Use AMDFFT: NO

-- Use AMDBLAS: NO

-- Python: -- Interpreter: /usr/local/bin/python2 (ver 2.7.3) -- Libraries: /usr/lib/libpython2.7.dylib (ver 2.7.2) -- numpy: /usr/local/lib/python2.7/site-packages/numpy/core/include (ver 1.6.2)

-- packages path: lib/python2.7/site-packages

-- Java: -- ant: /usr/bin/ant (ver 1.8.4) -- JNI: /System/Library/Frameworks/JavaVM.framework/Headers /System/Library/Frameworks/JavaVM.framework/Headers /System/Library/Frameworks/JavaVM.framework/Headers

-- Java tests: YES

-- Documentation: -- Build Documentation: NO -- Sphinx: NO

-- PdfLaTeX compiler: NO

-- Tests and samples: -- Tests: YES -- Performance tests: YES

-- C/C++ Examples: NO

-- Install path: /usr/local

-- cvconfig.h is in: /Users/michael/Documents/project/opencv/build

-- -----------------------------------------------------------------

-- Configuring done -- Generating done -- Build files have been written to: /Users/michael/Documents/project/opencv/build Michaels-MacBook-Pro:build michael$ make -j4 Scanning dependencies of target zlib Scanning dependencies of target libjpeg Scanning dependencies of target libwebp Scanning dependencies of target libjasper [ 0%] Building C object 3rdparty/zlib/CMakeFiles/zlib.dir/adler32.c.o [ 1%] Building C object 3rdparty/zlib/CMakeFiles/zlib.dir/compress.c.o [ 1%] Building C object 3rdparty/zlib/CMakeFiles/zlib.dir/crc32.c.o [ 1%] Building C object 3rdparty/zlib/CMakeFiles/zlib.dir/deflate.c.o [ 1%] Building C object 3rdparty/libjpeg/CMakeFiles/libjpeg.dir/jaricom.c.o [ 1%] [ 1%] Building C object 3rdparty/libwebp/CMakeFiles/libwebp.dir/dec/alpha.c.o Building C object 3rdparty/libjasper/CMakeFiles/libjasper.dir/jas_cm.c.o [ 1%] Building C object 3rdparty/libjpeg/CMakeFiles/libjpeg.dir/jcapimin.c.o [ 1%] Building C object 3rdparty/libwebp/CMakeFiles/libwebp.dir/dec/buffer.c.o [ 1%] Building C object 3rdparty/libjpeg/CMakeFiles/libjpeg.dir/jcapistd.c.o [ 1%] [ 1%] Building C object 3rdparty/libwebp/CMakeFiles/libwebp.dir/dec/frame.c.o Building C object 3rdparty/libjpeg/CMakeFiles/libjpeg.dir/jcarith.c.o [ 1%] Building C object 3rdparty/libwebp/CMakeFiles/libwebp.dir/dec/idec.c.o [ 1%] Building C object 3rdparty/libjasper/CMakeFiles/libjasper.dir/jas_debug.c.o [ 1%] Building C object 3rdparty/libjpeg/CMakeFiles/libjpeg.dir/jccoefct.c.o [ 1%] Building C object 3rdparty/libjasper/CMakeFiles/libjasper.dir/jas_getopt.c.o [ 1%] [ 1%] Building C object 3rdparty/zlib/CMakeFiles/zlib.dir/gzclose.c.o Building C object 3rdparty/libjasper/CMakeFiles/libjasper.dir/jas_icc.c.o [ 1%] Building C object 3rdparty/zlib/CMakeFiles/zlib.dir/gzlib.c.o [ 2%] Building C object 3rdparty/libwebp/CMakeFiles/libwebp.dir/dec/io.c.o [ 2%] Building C object 3rdparty/libjpeg/CMakeFiles/libjpeg.dir/jccolor.c.o [ 2%] Building C object 3rdparty/zlib/CMakeFiles/zlib.dir/gzread.c.o [ 2%] Building C object 3rdparty/libjpeg/CMakeFiles/libjpeg.dir/jcdctmgr.c.o [ 2%] Building C object 3rdparty/zlib/CMakeFiles/zlib.dir/gzwrite.c.o [ 2%] Building C object 3rdparty/libwebp/CMakeFiles/libwebp.dir/dec/layer.c.o [ 2%] Building C object 3rdparty/libjpeg/CMakeFiles/libjpeg.dir/jchuff.c.o [ 2%] Building C object 3rdparty/libwebp/CMakeFiles/libwebp.dir/dec/quant.c.o [ 2%] Building C object 3rdparty/libwebp/CMakeFiles/libwebp.dir/dec/tree.c.o [ 2%] Building C object 3rdparty/zlib/CMakeFiles/zlib.dir/inflate.c.o [ 2%] Building C object 3rdparty/libwebp/CMakeFiles/libwebp.dir/dec/vp8.c.o [ 2%] Building C object 3rdparty/libjpeg/CMakeFiles/libjpeg.dir/jcinit.c.o [ 3%] Building C object 3rdparty/libjpeg/CMakeFiles/libjpeg.dir/jcmainct.c.o [ 3%] Building C object 3rdparty/libjpeg/CMakeFiles/libjpeg.dir/jcmarker.c.o [ 3%] Building C object 3rdparty/libwebp/CMakeFiles/libwebp.dir/dec/vp8l.c.o [ 3%] Building C object 3rdparty/zlib/CMakeFiles/zlib.dir/infback.c.o [ 3%] Building C object 3rdparty/libjpeg/CMakeFiles/libjpeg.dir/jcmaster.c.o [ 4%] Building C object 3rdparty/libjasper/CMakeFiles/libjasper.dir/jas_iccdata.c.o [ 4%] [ 4%] Building C object 3rdparty/libjasper/CMakeFiles/libjasper.dir/jas_image.c.o Building C object 3rdparty/zlib/CMakeFiles/zlib.dir/inftrees.c.o [ 4%] Building C object 3rdparty/libwebp/CMakeFiles/libwebp.dir/dec/webp.c.o [ 4%] Building C object 3rdparty/zlib/CMakeFiles/zlib.dir/inffast.c.o [ 4%] Building C object 3rdparty/libjpeg/CMakeFiles/libjpeg.dir/jcomapi.c.o [ 4%] Building C object 3rdparty/zlib/CMakeFiles/zlib.dir/trees.c.o [ 4%] Building C object 3rdparty/libjpeg/CMakeFiles/libjpeg.dir/jcparam.c.o [ 4%] Building C object 3rdparty/libwebp/CMakeFiles/libwebp.dir/dsp/cpu.c.o [ 4%] Building C object 3rdparty/libwebp/CMakeFiles/libwebp.dir/dsp/dec.c.o [ 4%] [ 4%] [ 4%] [ 4%] Building C object 3rdparty/zlib/CMakeFiles/zlib.dir/uncompr.c.o Building C object 3rdparty/libwebp/CMakeFiles/libwebp.dir/dsp/dec_neon.c.o Building C object 3rdparty/libjasper/CMakeFiles/libjasper.dir/jas_init.c.o Building C object 3rdparty/libjpeg/CMakeFiles/libjpeg.dir/jcprepct.c.o [ 4%] Building C object 3rdparty/libwebp/CMakeFiles/libwebp.dir/dsp/dec_sse2.c.o [ 5%] Building C object 3rdparty/zlib/CMakeFiles/zlib.dir/zutil.c.o [ 5%] Building C object 3rdparty/libjasper/CMakeFiles/libjasper.dir/jas_malloc.c.o [ 5%] Linking C static library ../lib/libzlib.a Building C object 3rdparty/libjpeg/CMakeFiles/libjpeg.dir/jcsample.c.o [ 5%] Building C object 3rdparty/libjasper/CMakeFiles/libjasper.dir/jas_seq.c.o [ 5%] Built target zlib Scanning dependencies of target libtiff [ 5%] Building C object 3rdparty/libtiff/CMakeFiles/libtiff.dir/tif_aux.c.o [ 5%] Building C object 3rdparty/libjpeg/CMakeFiles/libjpeg.dir/jctrans.c.o [ 5%] Building C object 3rdparty/libjasper/CMakeFiles/libjasper.dir/jas_stream.c.o [ 5%] Building C object 3rdparty/libjpeg/CMakeFiles/libjpeg.dir/jdapimin.c.o [ 5%] Building C object 3rdparty/libtiff/CMakeFiles/libtiff.dir/tif_close.c.o [ 5%] [ 5%] Building C object 3rdparty/libtiff/CMakeFiles/libtiff.dir/tif_codec.c.o Building C object 3rdparty/libwebp/CMakeFiles/libwebp.dir/dsp/enc.c.o [ 5%] Building C object 3rdparty/libjpeg/CMakeFiles/libjpeg.dir/jdapistd.c.o [ 6%] Building C object 3rdparty/libtiff/CMakeFiles/libtiff.dir/tif_color.c.o [ 6%] Building C object 3rdparty/libjpeg/CMakeFiles/libjpeg.dir/jdarith.c.o [ 6%] Building C object 3rdparty/libjasper/CMakeFiles/libjasper.dir/jas_string.c.o [ 6%] [ 6%] Building C object 3rdparty/libjasper/CMakeFiles/libjasper.dir/jas_tmr.c.o Building C object 3rdparty/libtiff/CMakeFiles/libtiff.dir/tif_compress.c.o [ 6%] Building C object 3rdparty/libjasper/CMakeFiles/libjasper.dir/jas_tvp.c.o [ 6%] [ 6%] Building C object 3rdparty/libjasper/CMakeFiles/libjasper.dir/jas_version.c.o Building C object 3rdparty/libtiff/CMakeFiles/libtiff.dir/tif_dir.c.o [ 6%] Building C object 3rdparty/libjasper/CMakeFiles/libjasper.dir/jp2_cod.c.o [ 6%] Building C object 3rdparty/libjpeg/CMakeFiles/libjpeg.dir/jdatadst.c.o [ 6%] Building C object 3rdparty/libwebp/CMakeFiles/libwebp.dir/dsp/enc_sse2.c.o [ 6%] Building C object 3rdparty/libjpeg/CMakeFiles/libjpeg.dir/jdatasrc.c.o [ 6%] Building C object 3rdparty/libjpeg/CMakeFiles/libjpeg.dir/jdcoefct.c.o [ 6%] Building C object 3rdparty/libwebp/CMakeFiles/libwebp.dir/dsp/lossless.c.o [ 7%] [ 7%] Building C object 3rdparty/libjpeg/CMakeFiles/libjpeg.dir/jdcolor.c.o Building C object 3rdparty/libjasper/CMakeFiles/libjasper.dir/jp2_dec.c.o [ 7%] Building C object 3rdparty/libjpeg/CMakeFiles/libjpeg.dir/jddctmgr.c.o [ 7%] Building C object 3rdparty/libjasper/CMakeFiles/libjasper.dir/jp2_enc.c.o [ 7%] Building C object 3rdparty/libjpeg/CMakeFiles/libjpeg.dir/jdhuff.c.o [ 7%] Building C object 3rdparty/libtiff/CMakeFiles/libtiff.dir/tif_dirinfo.c.o [ 7%] Building C object 3rdparty/libjasper/CMakeFiles/libjasper.dir/jpc_bs.c.o [ 8%] Building C object 3rdparty/libwebp/CMakeFiles/libwebp.dir/dsp/upsampling.c.o [ 9%] Building C object 3rdparty/libjasper/CMakeFiles/libjasper.dir/jpc_cs.c.o [ 9%] Building C object 3rdparty/libtiff/CMakeFiles/libtiff.dir/tif_dirread.c.o [ 9%] Building C object 3rdparty/libjpeg/CMakeFiles/libjpeg.dir/jdinput.c.o [ 9%] Building C object 3rdparty/libjpeg/CMakeFiles/libjpeg.dir/jdmainct.c.o [ 9%] [ 9%] Building C object 3rdparty/libjpeg/CMakeFiles/libjpeg.dir/jdmarker.c.o Building C object 3rdparty/libwebp/CMakeFiles/libwebp.dir/dsp/upsampling_sse2.c.o [ 9%] Building C object 3rdparty/libjasper/CMakeFiles/libjasper.dir/jpc_dec.c.o [ 9%] Building C object 3rdparty/libwebp/CMakeFiles/libwebp.dir/dsp/yuv.c.o [ 9%] Building C object 3rdparty/libwebp/CMakeFiles/libwebp.dir/enc/alpha.c.o [ 9%] Building C object 3rdparty/libwebp/CMakeFiles/libwebp.dir/enc/analysis.c.o [ 9%] Building C object 3rdparty/libjpeg/CMakeFiles/libjpeg.dir/jdmaster.c.o [ 9%] [ 9%] Building C object 3rdparty/libwebp/CMakeFiles/libwebp.dir/enc/backward_references.c.o Building C object 3rdparty/libjpeg/CMakeFiles/libjpeg.dir/jdmerge.c.o [ 9%] Building C object 3rdparty/libtiff/CMakeFiles/libtiff.dir/tif_dirwrite.c.o [ 9%] Building C object 3rdparty/libjasper/CMakeFiles/libjasper.dir/jpc_enc.c.o [ 9%] Building C object 3rdparty/libjpeg/CMakeFiles/libjpeg.dir/jdpostct.c.o [ 9%] Building C object 3rdparty/libjpeg/CMakeFiles/libjpeg.dir/jdsample.c.o [ 9%] Building C object 3rdparty/libjpeg/CMakeFiles/libjpeg.dir/jdtrans.c.o [ 9%] Building C object 3rdparty/libjpeg/CMakeFiles/libjpeg.dir/jerror.c.o [ 9%] Building C object 3rdparty/libjpeg/CMakeFiles/libjpeg.dir/jfdctflt.c.o [ 9%] Building C object 3rdparty/libwebp/CMakeFiles/libwebp.dir/enc/config.c.o [ 9%] Building C object 3rdparty/libwebp/CMakeFiles/libwebp.dir/enc/cost.c.o [ 9%] Building C object 3rdparty/libjpeg/CMakeFiles/libjpeg.dir/jfdctfst.c.o [ 10%] Building C object 3rdparty/libjpeg/CMakeFiles/libjpeg.dir/jfdctint.c.o [ 10%] Building C object 3rdparty/libwebp/CMakeFiles/libwebp.dir/enc/filter.c.o [ 10%] Building C object 3rdparty/libwebp/CMakeFiles/libwebp.dir/enc/frame.c.o [ 10%] Building C object 3rdparty/libtiff/CMakeFiles/libtiff.dir/tif_dumpmode.c.o [ 10%] Building C object 3rdparty/libtiff/CMakeFiles/libtiff.dir/tif_error.c.o [ 10%] Building C object 3rdparty/libtiff/CMakeFiles/libtiff.dir/tif_extension.c.o [ 10%] Building C object 3rdparty/libtiff/CMakeFiles/libtiff.dir/tif_fax3.c.o [ 10%] Building C object 3rdparty/libjasper/CMakeFiles/libjasper.dir/jpc_math.c.o [ 10%] Building C object 3rdparty/libwebp/CMakeFiles/libwebp.dir/enc/histogram.c.o [ 10%] Building C object 3rdparty/libjasper/CMakeFiles/libjasper.dir/jpc_mct.c.o [ 10%] [ 10%] Building C object 3rdparty/libjasper/CMakeFiles/libjasper.dir/jpc_mqcod.c.o Building C object 3rdparty/libjpeg/CMakeFiles/libjpeg.dir/jidctflt.c.o [ 10%] Building C object 3rdparty/libjasper/CMakeFiles/libjasper.dir/jpc_mqdec.c.o [ 10%] Building C object 3rdparty/libjpeg/CMakeFiles/libjpeg.dir/jidctfst.c.o [ 10%] Building C object 3rdparty/libjpeg/CMakeFiles/libjpeg.dir/jidctint.c.o [ 10%] Building C object 3rdparty/libjasper/CMakeFiles/libjasper.dir/jpc_mqenc.c.o [ 10%] Building C object 3rdparty/libwebp/CMakeFiles/libwebp.dir/enc/iterator.c.o [ 10%] Building C object 3rdparty/libwebp/CMakeFiles/libwebp.dir/enc/layer.c.o [ 11%] Building C object 3rdparty/libwebp/CMakeFiles/libwebp.dir/enc/picture.c.o [ 11%] Building C object 3rdparty/libjasper/CMakeFiles/libjasper.dir/jpc_qmfb.c.o [ 11%] Building C object 3rdparty/libtiff/CMakeFiles/libtiff.dir/tif_fax3sm.c.o [ 11%] Building C object 3rdparty/libtiff/CMakeFiles/libtiff.dir/tif_flush.c.o [ 11%] Building C object 3rdparty/libtiff/CMakeFiles/libtiff.dir/tif_getimage.c.o [ 11%] Building C object 3rdparty/libwebp/CMakeFiles/libwebp.dir/enc/quant.c.o [ 11%] [ 11%] Building C object 3rdparty/libwebp/CMakeFiles/libwebp.dir/enc/syntax.c.o Building C object 3rdparty/libjpeg/CMakeFiles/libjpeg.dir/jmemansi.c.o [ 11%] Building C object 3rdparty/libjpeg/CMakeFiles/libjpeg.dir/jmemmgr.c.o [ 11%] Building C object 3rdparty/libwebp/CMakeFiles/libwebp.dir/enc/tree.c.o [ 11%] Building C object 3rdparty/libjasper/CMakeFiles/libjasper.dir/jpc_t1cod.c.o [ 11%] Building C object 3rdparty/libwebp/CMakeFiles/libwebp.dir/enc/vp8l.c.o [ 11%] Building C object 3rdparty/libjpeg/CMakeFiles/libjpeg.dir/jquant1.c.o [ 11%] Building C object 3rdparty/libjasper/CMakeFiles/libjasper.dir/jpc_t1dec.c.o [ 11%] Building C object 3rdparty/libjpeg/CMakeFiles/libjpeg.dir/jquant2.c.o [ 11%] Building C object 3rdparty/libwebp/CMakeFiles/libwebp.dir/enc/webpenc.c.o [ 11%] Building C object 3rdparty/libwebp/CMakeFiles/libwebp.dir/mux/demux.c.o [ 11%] Building C object 3rdparty/libjpeg/CMakeFiles/libjpeg.dir/jutils.c.o Linking C static library ../lib/liblibjpeg.a [ 11%] Building C object 3rdparty/libtiff/CMakeFiles/libtiff.dir/tif_jbig.c.o [ 11%] Built target libjpeg Scanning dependencies of target libpng [ 12%] Building C object 3rdparty/libtiff/CMakeFiles/libtiff.dir/tif_jpeg_12.c.o [ 12%] Building C object 3rdparty/libtiff/CMakeFiles/libtiff.dir/tif_jpeg.c.o [ 12%] Building C object 3rdparty/libpng/CMakeFiles/libpng.dir/png.c.o [ 12%] Building C object 3rdparty/libtiff/CMakeFiles/libtiff.dir/tif_luv.c.o [ 12%] Building C object 3rdparty/libwebp/CMakeFiles/libwebp.dir/mux/muxedit.c.o [ 12%] Building C object 3rdparty/libjasper/CMakeFiles/libjasper.dir/jpc_t1enc.c.o [ 12%] Building C object 3rdparty/libwebp/CMakeFiles/libwebp.dir/mux/muxinternal.c.o [ 12%] Building C object 3rdparty/libpng/CMakeFiles/libpng.dir/pngerror.c.o [ 12%] Building C object 3rdparty/libtiff/CMakeFiles/libtiff.dir/tif_lzma.c.o [ 12%] Building C object 3rdparty/libwebp/CMakeFiles/libwebp.dir/mux/muxread.c.o [ 12%] Building C object 3rdparty/libtiff/CMakeFiles/libtiff.dir/tif_lzw.c.o [ 12%] Building C object 3rdparty/libpng/CMakeFiles/libpng.dir/pngget.c.o [ 12%] Building C object 3rdparty/libwebp/CMakeFiles/libwebp.dir/utils/bit_reader.c.o [ 12%] Building C object 3rdparty/libwebp/CMakeFiles/libwebp.dir/utils/bit_writer.c.o [ 12%] Building C object 3rdparty/libtiff/CMakeFiles/libtiff.dir/tif_next.c.o [ 12%] Building C object 3rdparty/libwebp/CMakeFiles/libwebp.dir/utils/color_cache.c.o [ 12%] Building C object 3rdparty/libtiff/CMakeFiles/libtiff.dir/tif_ojpeg.c.o [ 12%] Building C object 3rdparty/libwebp/CMakeFiles/libwebp.dir/utils/filters.c.o [ 12%] Building C object 3rdparty/libtiff/CMakeFiles/libtiff.dir/tif_open.c.o [ 12%] Building C object 3rdparty/libpng/CMakeFiles/libpng.dir/pngmem.c.o [ 13%] Building C object 3rdparty/libpng/CMakeFiles/libpng.dir/pngpread.c.o [ 13%] Building C object 3rdparty/libtiff/CMakeFiles/libtiff.dir/tif_packbits.c.o [ 14%] Building C object 3rdparty/libwebp/CMakeFiles/libwebp.dir/utils/huffman.c.o [ 14%] Building C object 3rdparty/libtiff/CMakeFiles/libtiff.dir/tif_pixarlog.c.o [ 14%] Building C object 3rdparty/libwebp/CMakeFiles/libwebp.dir/utils/huffman_encode.c.o [ 14%] Building C object 3rdparty/libjasper/CMakeFiles/libjasper.dir/jpc_t2cod.c.o [ 14%] Building C object 3rdparty/libpng/CMakeFiles/libpng.dir/pngread.c.o [ 14%] Building C object 3rdparty/libwebp/CMakeFiles/libwebp.dir/utils/quant_levels.c.o [ 14%] Building C object 3rdparty/libwebp/CMakeFiles/libwebp.dir/utils/rescaler.c.o [ 14%] [ 14%] Building C object 3rdparty/libwebp/CMakeFiles/libwebp.dir/utils/thread.c.o Building C object 3rdparty/libjasper/CMakeFiles/libjasper.dir/jpc_t2dec.c.o [ 14%] Building C object 3rdparty/libwebp/CMakeFiles/libwebp.dir/utils/utils.c.o [ 14%] Building C object 3rdparty/libpng/CMakeFiles/libpng.dir/pngrio.c.o Linking C static library ../lib/liblibwebp.a [ 14%] Building C object 3rdparty/libpng/CMakeFiles/libpng.dir/pngrtran.c.o [ 15%] Building C object 3rdparty/libjasper/CMakeFiles/libjasper.dir/jpc_t2enc.c.o [ 15%] Built target libwebp Scanning dependencies of target IlmImf [ 15%] [ 15%] Building C object 3rdparty/libtiff/CMakeFiles/libtiff.dir/tif_predict.c.o Building C object 3rdparty/libjasper/CMakeFiles/libjasper.dir/jpc_tagtree.c.o [ 15%] Building C object 3rdparty/libjasper/CMakeFiles/libjasper.dir/jpc_tsfb.c.o [ 15%] Building CXX object 3rdparty/openexr/CMakeFiles/IlmImf.dir/Half/half.cpp.o [ 15%] Building C object 3rdparty/libtiff/CMakeFiles/libtiff.dir/tif_print.c.o [ 15%] Building C object 3rdparty/libjasper/CMakeFiles/libjasper.dir/jpc_util.c.o Linking C static library ../lib/liblibjasper.a [ 15%] Built target libjasper [ 15%] Building NVCC (Device) object modules/core/CMakeFiles/cuda_compile.dir/src/cuda/./cuda_compile_generated_matrix_operations.cu.o [ 15%] Building C object 3rdparty/libtiff/CMakeFiles/libtiff.dir/tif_read.c.o [ 15%] Building C object 3rdparty/libpng/CMakeFiles/libpng.dir/pngrutil.c.o [ 16%] Building C object 3rdparty/libtiff/CMakeFiles/libtiff.dir/tif_strip.c.o [ 16%] Building C object 3rdparty/libtiff/CMakeFiles/libtiff.dir/tif_swab.c.o [ 16%] Building C object 3rdparty/libtiff/CMakeFiles/libtiff.dir/tif_thunder.c.o [ 16%] Building C object 3rdparty/libtiff/CMakeFiles/libtiff.dir/tif_tile.c.o [ 16%] Building C object 3rdparty/libtiff/CMakeFiles/libtiff.dir/tif_version.c.o [ 16%] Building C object 3rdparty/libtiff/CMakeFiles/libtiff.dir/tif_warning.c.o [ 16%] Building C object 3rdparty/libtiff/CMakeFiles/libtiff.dir/tif_write.c.o [ 16%] Building C object 3rdparty/libtiff/CMakeFiles/libtiff.dir/tif_zip.c.o [ 16%] Building CXX object 3rdparty/libtiff/CMakeFiles/libtiff.dir/tif_stream.cxx.o [ 16%] Building C object 3rdparty/libpng/CMakeFiles/libpng.dir/pngset.c.o [ 16%] Building CXX object 3rdparty/openexr/CMakeFiles/IlmImf.dir/Iex/IexBaseExc.cpp.o [ 16%] Building C object 3rdparty/libpng/CMakeFiles/libpng.dir/pngtrans.c.o [ 16%] Building C object 3rdparty/libpng/CMakeFiles/libpng.dir/pngwio.c.o [ 16%] Building C object 3rdparty/libtiff/CMakeFiles/libtiff.dir/tif_unix.c.o [ 16%] Building C object 3rdparty/libpng/CMakeFiles/libpng.dir/pngwrite.c.o Linking CXX static library ../lib/liblibtiff.a /usr/bin/ranlib: file: ../lib/liblibtiff.a(tif_jbig.c.o) has no symbols /usr/bin/ranlib: file: ../lib/liblibtiff.a(tif_jpeg_12.c.o) has no symbols /usr/bin/ranlib: file: ../lib/liblibtiff.a(tif_jpeg.c.o) has no symbols /usr/bin/ranlib: file: ../lib/liblibtiff.a(tif_lzma.c.o) has no symbols /usr/bin/ranlib: file: ../lib/liblibtiff.a(tif_ojpeg.c.o) has no symbols /usr/bin/ranlib: file: ../lib/liblibtiff.a(tif_jbig.c.o) has no symbols /usr/bin/ranlib: file: ../lib/liblibtiff.a(tif_jpeg_12.c.o) has no symbols /usr/bin/ranlib: file: ../lib/liblibtiff.a(tif_jpeg.c.o) has no symbols /usr/bin/ranlib: file: ../lib/liblibtiff.a(tif_lzma.c.o) has no symbols /usr/bin/ranlib: file: ../lib/liblibtiff.a(tif_ojpeg.c.o) has no symbols [ 16%] Built target libtiff [ 16%] Building CXX object 3rdparty/openexr/CMakeFiles/IlmImf.dir/Iex/IexThrowErrnoExc.cpp.o [ 16%] Building C object 3rdparty/libpng/CMakeFiles/libpng.dir/pngwtran.c.o [ 16%] Building C object 3rdparty/libpng/CMakeFiles/libpng.dir/pngwutil.c.o [ 16%] Building CXX object 3rdparty/openexr/CMakeFiles/IlmImf.dir/IlmThread/IlmThread.cpp.o [ 16%] Building CXX object 3rdparty/openexr/CMakeFiles/IlmImf.dir/IlmThread/IlmThreadMutex.cpp.o [ 16%] Building CXX object 3rdparty/openexr/CMakeFiles/IlmImf.dir/IlmThread/IlmThreadMutexPosix.cpp.o Linking C static library ../lib/liblibpng.a [ 16%] Built target libpng [ 16%] Building CXX object 3rdparty/openexr/CMakeFiles/IlmImf.dir/IlmThread/IlmThreadPool.cpp.o [ 16%] Building CXX object 3rdparty/openexr/CMakeFiles/IlmImf.dir/IlmThread/IlmThreadPosix.cpp.o [ 16%] Building CXX object 3rdparty/openexr/CMakeFiles/IlmImf.dir/IlmThread/IlmThreadSemaphore.cpp.o [ 16%] Building CXX object 3rdparty/openexr/CMakeFiles/IlmImf.dir/IlmThread/IlmThreadSemaphorePosix.cpp.o [ 16%] Building CXX object 3rdparty/openexr/CMakeFiles/IlmImf.dir/IlmThread/IlmThreadSemaphorePosixCompat.cpp.o [ 16%] Building CXX object 3rdparty/openexr/CMakeFiles/IlmImf.dir/Imath/ImathColorAlgo.cpp.o [ 16%] Building CXX object 3rdparty/openexr/CMakeFiles/IlmImf.dir/Imath/ImathFun.cpp.o [ 17%] Building CXX object 3rdparty/openexr/CMakeFiles/IlmImf.dir/Imath/ImathMatrixAlgo.cpp.o [ 17%] Building CXX object 3rdparty/openexr/CMakeFiles/IlmImf.dir/Imath/ImathRandom.cpp.o [ 17%] Building CXX object 3rdparty/openexr/CMakeFiles/IlmImf.dir/Imath/ImathVec.cpp.o [ 17%] Building CXX object 3rdparty/openexr/CMakeFiles/IlmImf.dir/IlmImf/ImfAcesFile.cpp.o cc1: warning: command line option "-Wsign-promo" is valid for C++/ObjC++ but not for C [ 17%] Building CXX object 3rdparty/openexr/CMakeFiles/IlmImf.dir/IlmImf/ImfAttribute.cpp.o cc1: warning: command line option "-Wsign-promo" is valid for C++/ObjC++ but not for C [ 17%] Building CXX object 3rdparty/openexr/CMakeFiles/IlmImf.dir/IlmImf/ImfB44Compressor.cpp.o [ 17%] Building CXX object 3rdparty/openexr/CMakeFiles/IlmImf.dir/IlmImf/ImfBoxAttribute.cpp.o [ 17%] Building CXX object 3rdparty/openexr/CMakeFiles/IlmImf.dir/IlmImf/ImfChannelList.cpp.o [ 17%] Building CXX object 3rdparty/openexr/CMakeFiles/IlmImf.dir/IlmImf/ImfChannelListAttribute.cpp.o cc1: warning: command line option "-Wsign-promo" is valid for C++/ObjC++ but not for C cc1: warning: command line option "-Wsign-promo" is valid for C++/ObjC++ but not for C [ 17%] Building CXX object 3rdparty/openexr/CMakeFiles/IlmImf.dir/IlmImf/ImfChromaticities.cpp.o [ 17%] Building CXX object 3rdparty/openexr/CMakeFiles/IlmImf.dir/IlmImf/ImfChromaticitiesAttribute.cpp.o [ 17%] Building CXX object 3rdparty/openexr/CMakeFiles/IlmImf.dir/IlmImf/ImfCompressionAttribute.cpp.o [ 17%] Building CXX object 3rdparty/openexr/CMakeFiles/IlmImf.dir/IlmImf/ImfCompressor.cpp.o [ 17%] Building CXX object 3rdparty/openexr/CMakeFiles/IlmImf.dir/IlmImf/ImfConvert.cpp.o [ 18%] Building CXX object 3rdparty/openexr/CMakeFiles/IlmImf.dir/IlmImf/ImfCRgbaFile.cpp.o cc1: warning: command line option "-Wsign-promo" is valid for C++/ObjC++ but not for C [ 18%] Building CXX object 3rdparty/openexr/CMakeFiles/IlmImf.dir/IlmImf/ImfDoubleAttribute.cpp.o [ 18%] Building CXX object 3rdparty/openexr/CMakeFiles/IlmImf.dir/IlmImf/ImfEnvmap.cpp.o cc1: warning: command line option "-Wsign-promo" is valid for C++/ObjC++ but not for C [ 18%] Building CXX object 3rdparty/openexr/CMakeFiles/IlmImf.dir/IlmImf/ImfEnvmapAttribute.cpp.o [ 18%] Building CXX object 3rdparty/openexr/CMakeFiles/IlmImf.dir/IlmImf/ImfFloatAttribute.cpp.o [ 18%] Building CXX object 3rdparty/openexr/CMakeFiles/IlmImf.dir/IlmImf/ImfFrameBuffer.cpp.o [ 18%] Building CXX object 3rdparty/openexr/CMakeFiles/IlmImf.dir/IlmImf/ImfFramesPerSecond.cpp.o [ 18%] Building CXX object 3rdparty/openexr/CMakeFiles/IlmImf.dir/IlmImf/ImfHeader.cpp.o [ 18%] Building CXX object 3rdparty/openexr/CMakeFiles/IlmImf.dir/IlmImf/ImfHuf.cpp.o [ 18%] Building CXX object 3rdparty/openexr/CMakeFiles/IlmImf.dir/IlmImf/ImfInputFile.cpp.o [ 18%] Building CXX object 3rdparty/openexr/CMakeFiles/IlmImf.dir/IlmImf/ImfIntAttribute.cpp.o cc1: warning: command line option "-Wsign-promo" is valid for C++/ObjC++ but not for C [ 18%] Building CXX object 3rdparty/openexr/CMakeFiles/IlmImf.dir/IlmImf/ImfIO.cpp.o cc1: warning: command line option "-Wsign-promo" is valid for C++/ObjC++ but not for C cc1: warning: command line option "-Wsign-promo" is valid for C++/ObjC++ but not for C [ 18%] Building CXX object 3rdparty/openexr/CMakeFiles/IlmImf.dir/IlmImf/ImfKeyCode.cpp.o cc1: warning: command line option "-Wsign-promo" is valid for C++/ObjC++ but not for C [ 19%] Building CXX object 3rdparty/openexr/CMakeFiles/IlmImf.dir/IlmImf/ImfKeyCodeAttribute.cpp.o [ 19%] Building CXX object 3rdparty/openexr/CMakeFiles/IlmImf.dir/IlmImf/ImfLineOrderAttribute.cpp.o [ 19%] Building CXX object 3rdparty/openexr/CMakeFiles/IlmImf.dir/IlmImf/ImfLut.cpp.o [ 19%] Building CXX object 3rdparty/openexr/CMakeFiles/IlmImf.dir/IlmImf/ImfMatrixAttribute.cpp.o [ 19%] Building CXX object 3rdparty/openexr/CMakeFiles/IlmImf.dir/IlmImf/ImfMisc.cpp.o [ 19%] Building CXX object 3rdparty/openexr/CMakeFiles/IlmImf.dir/IlmImf/ImfMultiView.cpp.o [ 19%] Building CXX object 3rdparty/openexr/CMakeFiles/IlmImf.dir/IlmImf/ImfOpaqueAttribute.cpp.o [ 19%] Building CXX object 3rdparty/openexr/CMakeFiles/IlmImf.dir/IlmImf/ImfOutputFile.cpp.o [ 19%] Building CXX object 3rdparty/openexr/CMakeFiles/IlmImf.dir/IlmImf/ImfPizCompressor.cpp.o [ 19%] Building CXX object 3rdparty/openexr/CMakeFiles/IlmImf.dir/IlmImf/ImfPreviewImage.cpp.o [ 19%] Building CXX object 3rdparty/openexr/CMakeFiles/IlmImf.dir/IlmImf/ImfPreviewImageAttribute.cpp.o [ 19%] Building CXX object 3rdparty/openexr/CMakeFiles/IlmImf.dir/IlmImf/ImfPxr24Compressor.cpp.o [ 19%] Building CXX object 3rdparty/openexr/CMakeFiles/IlmImf.dir/IlmImf/ImfRational.cpp.o [ 19%] Building CXX object 3rdparty/openexr/CMakeFiles/IlmImf.dir/IlmImf/ImfRationalAttribute.cpp.o [ 20%] Building CXX object 3rdparty/openexr/CMakeFiles/IlmImf.dir/IlmImf/ImfRgbaFile.cpp.o [ 20%] Building CXX object 3rdparty/openexr/CMakeFiles/IlmImf.dir/IlmImf/ImfRgbaYca.cpp.o [ 20%] Building CXX object 3rdparty/openexr/CMakeFiles/IlmImf.dir/IlmImf/ImfRleCompressor.cpp.o [ 20%] Building CXX object 3rdparty/openexr/CMakeFiles/IlmImf.dir/IlmImf/ImfScanLineInputFile.cpp.o [ 20%] Building CXX object 3rdparty/openexr/CMakeFiles/IlmImf.dir/IlmImf/ImfStandardAttributes.cpp.o [ 20%] Building CXX object 3rdparty/openexr/CMakeFiles/IlmImf.dir/IlmImf/ImfStdIO.cpp.o [ 20%] Building CXX object 3rdparty/openexr/CMakeFiles/IlmImf.dir/IlmImf/ImfStringAttribute.cpp.o [ 20%] Building CXX object 3rdparty/openexr/CMakeFiles/IlmImf.dir/IlmImf/ImfStringVectorAttribute.cpp.o [ 20%] Building CXX object 3rdparty/openexr/CMakeFiles/IlmImf.dir/IlmImf/ImfTestFile.cpp.o [ 20%] Building CXX object 3rdparty/openexr/CMakeFiles/IlmImf.dir/IlmImf/ImfThreading.cpp.o [ 20%] Building CXX object 3rdparty/openexr/CMakeFiles/IlmImf.dir/IlmImf/ImfTileDescriptionAttribute.cpp.o [ 20%] Building CXX object 3rdparty/openexr/CMakeFiles/IlmImf.dir/IlmImf/ImfTiledInputFile.cpp.o [ 20%] Building CXX object 3rdparty/openexr/CMakeFiles/IlmImf.dir/IlmImf/ImfTiledMisc.cpp.o [ 20%] Building CXX object 3rdparty/openexr/CMakeFiles/IlmImf.dir/IlmImf/ImfTiledOutputFile.cpp.o ptxas /tmp/tmpxft_000018b8_00000000-17_matrix_operations.compute_11.ptx, line 581; warning : Double is not supported. Demoting to float [ 21%] Building CXX object 3rdparty/openexr/CMakeFiles/IlmImf.dir/IlmImf/ImfTiledRgbaFile.cpp.o [ 21%] Building CXX object 3rdparty/openexr/CMakeFiles/IlmImf.dir/IlmImf/ImfTileOffsets.cpp.o [ 21%] Building CXX object 3rdparty/openexr/CMakeFiles/IlmImf.dir/IlmImf/ImfTimeCode.cpp.o [ 21%] Building CXX object 3rdparty/openexr/CMakeFiles/IlmImf.dir/IlmImf/ImfTimeCodeAttribute.cpp.o [ 21%] Building CXX object 3rdparty/openexr/CMakeFiles/IlmImf.dir/IlmImf/ImfVecAttribute.cpp.o [ 21%] Building CXX object 3rdparty/openexr/CMakeFiles/IlmImf.dir/IlmImf/ImfVersion.cpp.o [ 21%] Building CXX object 3rdparty/openexr/CMakeFiles/IlmImf.dir/IlmImf/ImfWav.cpp.o [ 21%] Building CXX object 3rdparty/openexr/CMakeFiles/IlmImf.dir/IlmImf/ImfZipCompressor.cpp.o Linking CXX static library ../lib/libIlmImf.a /usr/bin/ranlib: file: ../lib/libIlmImf.a(IlmThread.cpp.o) has no symbols /usr/bin/ranlib: file: ../lib/libIlmImf.a(IlmThreadMutex.cpp.o) has no symbols /usr/bin/ranlib: file: ../lib/libIlmImf.a(IlmThreadSemaphore.cpp.o) has no symbols /usr/bin/ranlib: file: ../lib/libIlmImf.a(IlmThreadSemaphorePosixCompat.cpp.o) has no symbols /usr/bin/ranlib: file: ../lib/libIlmImf.a(IlmThread.cpp.o) has no symbols /usr/bin/ranlib: file: ../lib/libIlmImf.a(IlmThreadMutex.cpp.o) has no symbols /usr/bin/ranlib: file: ../lib/libIlmImf.a(IlmThreadSemaphore.cpp.o) has no symbols /usr/bin/ranlib: file: ../lib/libIlmImf.a(IlmThreadSemaphorePosixCompat.cpp.o) has no symbols [ 21%] Built target IlmImf ptxas /tmp/tmpxft_000018b8_00000000-14_matrix_operations.compute_12.ptx, line 581; warning : Double is not supported. Demoting to float Scanning dependencies of target opencv_core [ 21%] [ 21%] Building CXX object modules/core/CMakeFiles/opencv_core.dir/src/alloc.cpp.o [ 21%] Building CXX object modules/core/CMakeFiles/opencv_core.dir/src/algorithm.cpp.o [ 21%] Building CXX object modules/core/CMakeFiles/opencv_core.dir/src/arithm.cpp.o Building CXX object modules/core/CMakeFiles/opencv_core.dir/src/array.cpp.o [ 21%] Building CXX object modules/core/CMakeFiles/opencv_core.dir/src/command_line_parser.cpp.o [ 21%] Building CXX object modules/core/CMakeFiles/opencv_core.dir/src/convert.cpp.o [ 21%] Building CXX object modules/core/CMakeFiles/opencv_core.dir/src/copy.cpp.o [ 21%] Building CXX object modules/core/CMakeFiles/opencv_core.dir/src/cudastream.cpp.o [ 22%] Building CXX object modules/core/CMakeFiles/opencv_core.dir/src/datastructs.cpp.o [ 22%] Building CXX object modules/core/CMakeFiles/opencv_core.dir/src/drawing.cpp.o [ 22%] Building CXX object modules/core/CMakeFiles/opencv_core.dir/src/dxt.cpp.o [ 22%] Building CXX object modules/core/CMakeFiles/opencv_core.dir/src/gl_core_3_1.cpp.o [ 22%] Building CXX object modules/core/CMakeFiles/opencv_core.dir/src/glob.cpp.o [ 22%] Building CXX object modules/core/CMakeFiles/opencv_core.dir/src/gpumat.cpp.o [ 22%] Building CXX object modules/core/CMakeFiles/opencv_core.dir/src/lapack.cpp.o [ 22%] Building CXX object modules/core/CMakeFiles/opencv_core.dir/src/mathfuncs.cpp.o [ 22%] Building CXX object modules/core/CMakeFiles/opencv_core.dir/src/matmul.cpp.o [ 22%] Building CXX object modules/core/CMakeFiles/opencv_core.dir/src/matop.cpp.o [ 22%] Building CXX object modules/core/CMakeFiles/opencv_core.dir/src/matrix.cpp.o [ 22%] Building CXX object modules/core/CMakeFiles/opencv_core.dir/src/matrix_operations.cpp.o [ 22%] Building CXX object modules/core/CMakeFiles/opencv_core.dir/src/opengl_interop.cpp.o [ 22%] Building CXX object modules/core/CMakeFiles/opencv_core.dir/src/out.cpp.o [ 23%] Building CXX object modules/core/CMakeFiles/opencv_core.dir/src/parallel.cpp.o [ 23%] Building CXX object modules/core/CMakeFiles/opencv_core.dir/src/persistence.cpp.o [ 23%] Building CXX object modules/core/CMakeFiles/opencv_core.dir/src/precomp.cpp.o [ 23%] Building CXX object modules/core/CMakeFiles/opencv_core.dir/src/rand.cpp.o [ 23%] Building CXX object modules/core/CMakeFiles/opencv_core.dir/src/stat.cpp.o [ 23%] Building CXX object modules/core/CMakeFiles/opencv_core.dir/src/stl.cpp.o [ 23%] Building CXX object modules/core/CMakeFiles/opencv_core.dir/src/system.cpp.o [ 23%] Building CXX object modules/core/CMakeFiles/opencv_core.dir/src/tables.cpp.o [ 23%] Building CXX object modules/core/CMakeFiles/opencv_core.dir/src/types.cpp.o Linking CXX shared library ../../lib/libopencv_core.dylib [ 23%] Built target opencv_core Scanning dependencies of target opencv_flann Scanning dependencies of target opencv_ml Scanning dependencies of target opencv_imgproc [ 23%] [ 23%] Building CXX object modules/flann/CMakeFiles/opencv_flann.dir/src/miniflann.cpp.o Building CXX object modules/flann/CMakeFiles/opencv_flann.dir/src/flann.cpp.o [ 23%] Building CXX object modules/ml/CMakeFiles/opencv_ml.dir/src/ann_mlp.cpp.o [ 23%] Building CXX object modules/imgproc/CMakeFiles/opencv_imgproc.dir/src/accum.cpp.o [ 23%] Building CXX object modules/flann/CMakeFiles/opencv_flann.dir/src/precomp.cpp.o [ 23%] Building CXX object modules/ml/CMakeFiles/opencv_ml.dir/src/boost.cpp.o [ 23%] Building CXX object modules/imgproc/CMakeFiles/opencv_imgproc.dir/src/approx.cpp.o [ 24%] Building CXX object modules/imgproc/CMakeFiles/opencv_imgproc.dir/src/canny.cpp.o [ 25%] Building CXX object modules/ml/CMakeFiles/opencv_ml.dir/src/cnn.cpp.o [ 25%] Building CXX object modules/ml/CMakeFiles/opencv_ml.dir/src/data.cpp.o [ 25%] Building CXX object modules/imgproc/CMakeFiles/opencv_imgproc.dir/src/color.cpp.o [ 25%] Building CXX object modules/imgproc/CMakeFiles/opencv_imgproc.dir/src/connectedcomponents.cpp.o [ 25%] Building CXX object modules/ml/CMakeFiles/opencv_ml.dir/src/em.cpp.o [ 25%] Building CXX object modules/imgproc/CMakeFiles/opencv_imgproc.dir/src/contours.cpp.o [ 25%] Building CXX object modules/ml/CMakeFiles/opencv_ml.dir/src/ertrees.cpp.o [ 25%] Building CXX object modules/imgproc/CMakeFiles/opencv_imgproc.dir/src/convhull.cpp.o [ 25%] Building CXX object modules/ml/CMakeFiles/opencv_ml.dir/src/estimate.cpp.o Linking CXX shared library ../../lib/libopencv_flann.dylib [ 25%] Built target opencv_flann [ 25%] Building CXX object modules/ml/CMakeFiles/opencv_ml.dir/src/gbt.cpp.o [ 25%] Building CXX object modules/ml/CMakeFiles/opencv_ml.dir/src/inner_functions.cpp.o [ 25%] Building CXX object modules/ml/CMakeFiles/opencv_ml.dir/src/knearest.cpp.o [ 25%] Building CXX object modules/imgproc/CMakeFiles/opencv_imgproc.dir/src/corner.cpp.o [ 25%] Building CXX object modules/imgproc/CMakeFiles/opencv_imgproc.dir/src/cornersubpix.cpp.o [ 25%] Building CXX object modules/imgproc/CMakeFiles/opencv_imgproc.dir/src/demosaicing.cpp.o [ 25%] Building CXX object modules/imgproc/CMakeFiles/opencv_imgproc.dir/src/deriv.cpp.o [ 25%] Building CXX object modules/ml/CMakeFiles/opencv_ml.dir/src/ml_init.cpp.o [ 25%] Building CXX object modules/ml/CMakeFiles/opencv_ml.dir/src/nbayes.cpp.o [ 25%] Building CXX object modules/imgproc/CMakeFiles/opencv_imgproc.dir/src/distransform.cpp.o [ 25%] Building CXX object modules/ml/CMakeFiles/opencv_ml.dir/src/precomp.cpp.o [ 25%] Building CXX object modules/imgproc/CMakeFiles/opencv_imgproc.dir/src/emd.cpp.o [ 25%] Building CXX object modules/imgproc/CMakeFiles/opencv_imgproc.dir/src/featureselect.cpp.o [ 25%] Building CXX object modules/ml/CMakeFiles/opencv_ml.dir/src/rtrees.cpp.o [ 25%] Building CXX object modules/imgproc/CMakeFiles/opencv_imgproc.dir/src/filter.cpp.o [ 25%] Building CXX object modules/imgproc/CMakeFiles/opencv_imgproc.dir/src/floodfill.cpp.o [ 26%] Building CXX object modules/imgproc/CMakeFiles/opencv_imgproc.dir/src/gabor.cpp.o [ 26%] Building CXX object modules/ml/CMakeFiles/opencv_ml.dir/src/svm.cpp.o [ 26%] Building CXX object modules/imgproc/CMakeFiles/opencv_imgproc.dir/src/generalized_hough.cpp.o [ 26%] Building CXX object modules/ml/CMakeFiles/opencv_ml.dir/src/testset.cpp.o [ 26%] Building CXX object modules/imgproc/CMakeFiles/opencv_imgproc.dir/src/geometry.cpp.o [ 27%] Building CXX object modules/ml/CMakeFiles/opencv_ml.dir/src/tree.cpp.o [ 27%] Building CXX object modules/imgproc/CMakeFiles/opencv_imgproc.dir/src/grabcut.cpp.o [ 27%] Building CXX object modules/imgproc/CMakeFiles/opencv_imgproc.dir/src/histogram.cpp.o [ 27%] Building CXX object modules/imgproc/CMakeFiles/opencv_imgproc.dir/src/hough.cpp.o Linking CXX shared library ../../lib/libopencv_ml.dylib [ 27%] Built target opencv_ml [ 27%] Building CXX object modules/imgproc/CMakeFiles/opencv_imgproc.dir/src/imgwarp.cpp.o [ 27%] Building CXX object modules/imgproc/CMakeFiles/opencv_imgproc.dir/src/linefit.cpp.o [ 27%] Building CXX object modules/imgproc/CMakeFiles/opencv_imgproc.dir/src/matchcontours.cpp.o [ 27%] Building CXX object modules/imgproc/CMakeFiles/opencv_imgproc.dir/src/moments.cpp.o [ 27%] Building CXX object modules/imgproc/CMakeFiles/opencv_imgproc.dir/src/morph.cpp.o [ 27%] Building CXX object modules/imgproc/CMakeFiles/opencv_imgproc.dir/src/phasecorr.cpp.o [ 27%] Building CXX object modules/imgproc/CMakeFiles/opencv_imgproc.dir/src/precomp.cpp.o [ 27%] Building CXX object modules/imgproc/CMakeFiles/opencv_imgproc.dir/src/pyramids.cpp.o [ 28%] Building CXX object modules/imgproc/CMakeFiles/opencv_imgproc.dir/src/rotcalipers.cpp.o [ 28%] Building CXX object modules/imgproc/CMakeFiles/opencv_imgproc.dir/src/samplers.cpp.o [ 28%] Building CXX object modules/imgproc/CMakeFiles/opencv_imgproc.dir/src/segmentation.cpp.o [ 28%] Building CXX object modules/imgproc/CMakeFiles/opencv_imgproc.dir/src/shapedescr.cpp.o [ 28%] Building CXX object modules/imgproc/CMakeFiles/opencv_imgproc.dir/src/smooth.cpp.o [ 28%] Building CXX object modules/imgproc/CMakeFiles/opencv_imgproc.dir/src/subdivision2d.cpp.o [ 28%] Building CXX object modules/imgproc/CMakeFiles/opencv_imgproc.dir/src/sumpixels.cpp.o [ 28%] Building CXX object modules/imgproc/CMakeFiles/opencv_imgproc.dir/src/tables.cpp.o [ 28%] Building CXX object modules/imgproc/CMakeFiles/opencv_imgproc.dir/src/templmatch.cpp.o [ 28%] Building CXX object modules/imgproc/CMakeFiles/opencv_imgproc.dir/src/thresh.cpp.o [ 28%] Building CXX object modules/imgproc/CMakeFiles/opencv_imgproc.dir/src/undistort.cpp.o [ 28%] Building CXX object modules/imgproc/CMakeFiles/opencv_imgproc.dir/src/utils.cpp.o Linking CXX shared library ../../lib/libopencv_imgproc.dylib [ 28%] Built target opencv_imgproc Scanning dependencies of target opencv_highgui Scanning dependencies of target opencv_video Scanning dependencies of target opencv_photo [ 28%] Building NVCC (Device) object modules/softcascade/CMakeFiles/cuda_compile.dir/src/cuda/./cuda_compile_generated_icf-sc.cu.o [ 28%] Building CXX object modules/photo/CMakeFiles/opencv_photo.dir/src/denoising.cpp.o [ 28%] Building CXX object modules/video/CMakeFiles/opencv_video.dir/src/affineflow.cpp.o [ 28%] Building CXX object modules/highgui/CMakeFiles/opencv_highgui.dir/src/cap.cpp.o [ 28%] Building CXX object modules/highgui/CMakeFiles/opencv_highgui.dir/src/cap_images.cpp.o [ 29%] Building CXX object modules/video/CMakeFiles/opencv_video.dir/src/bgfg_gaussmix.cpp.o cc1: warning: command line option "-Wno-sign-promo" is valid for C++/ObjC++ but not for C cc1: warning: command line option "-Wno-sign-promo" is valid for C++/ObjC++ but not for C cc1: warning: command line option "-Wno-sign-promo" is valid for C++/ObjC++ but not for C cc1: warning: command line option "-Wno-sign-promo" is valid for C++/ObjC++ but not for C [ 29%] Building CXX object modules/photo/CMakeFiles/opencv_photo.dir/src/inpaint.cpp.o [ 29%] Building CXX object modules/highgui/CMakeFiles/opencv_highgui.dir/src/cap_ffmpeg.cpp.o cc1: warning: command line option "-Wno-sign-promo" is valid for C++/ObjC++ but not for C cc1: warning: command line option "-Wno-sign-promo" is valid for C++/ObjC++ but not for C [ 29%] Building CXX object modules/video/CMakeFiles/opencv_video.dir/src/bgfg_gaussmix2.cpp.o cc1: warning: command line option "-Wno-sign-promo" is valid for C++/ObjC++ but not for C cc1: warning: command line option "-Wno-sign-promo" is valid for C++/ObjC++ but not for C cc1: warning: command line option "-Wno-sign-promo" is valid for C++/ObjC++ but not for C cc1: warning: command line option "-Wno-sign-promo" is valid for C++/ObjC++ but not for C [ 29%] Building CXX object modules/highgui/CMakeFiles/opencv_highgui.dir/src/loadsave.cpp.o [ 29%] Building CXX object modules/photo/CMakeFiles/opencv_photo.dir/src/precomp.cpp.o [ 29%] Building CXX object modules/video/CMakeFiles/opencv_video.dir/src/bgfg_gmg.cpp.o Linking CXX shared library ../../lib/libopencv_photo.dylib [ 29%] Built target opencv_photo [ 29%] Building NVCC (Device) object modules/softcascade/CMakeFiles/cuda_compile.dir/src/cuda/./cuda_compile_generated_channels.cu.o ptxas /tmp/tmpxft_00001fcc_00000000-17_icf-sc.compute_11.ptx, line 899; warning : Double is not supported. Demoting to float [ 29%] Building CXX object modules/highgui/CMakeFiles/opencv_highgui.dir/src/precomp.cpp.o [ 29%] Building CXX object modules/video/CMakeFiles/opencv_video.dir/src/camshift.cpp.o cc1: warning: command line option "-Wno-sign-promo" is valid for C++/ObjC++ but not for C cc1: warning: command line option "-Wno-sign-promo" is valid for C++/ObjC++ but not for C cc1: warning: command line option "-Wno-sign-promo" is valid for C++/ObjC++ but not for C cc1: warning: command line option "-Wno-sign-promo" is valid for C++/ObjC++ but not for C [ 29%] Building CXX object modules/highgui/CMakeFiles/opencv_highgui.dir/src/utils.cpp.o [ 29%] Building CXX object modules/video/CMakeFiles/opencv_video.dir/src/compat_video.cpp.o cc1: warning: command line option "-Wno-sign-promo" is valid for C++/ObjC++ but not for C cc1: warning: command line option "-Wno-sign-promo" is valid for C++/ObjC++ but not for C ptxas /tmp/tmpxft_00001fcc_00000000-14_icf-sc.compute_12.ptx, line 899; warning : Double is not supported. Demoting to float [ 29%] Building CXX object modules/highgui/CMakeFiles/opencv_highgui.dir/src/window.cpp.o cc1: warning: command line option "-Wno-sign-promo" is valid for C++/ObjC++ but not for C cc1: warning: command line option "-Wno-sign-promo" is valid for C++/ObjC++ but not for C cc1: warning: command line option "-Wno-sign-promo" is valid for C++/ObjC++ but not for C cc1: warning: command line option "-Wno-sign-promo" is valid for C++/ObjC++ but not for C [ 29%] Building CXX object modules/video/CMakeFiles/opencv_video.dir/src/ecc.cpp.o [ 29%] Building CXX object modules/highgui/CMakeFiles/opencv_highgui.dir/src/window_cocoa.mm.o [ 29%] Building CXX object modules/video/CMakeFiles/opencv_video.dir/src/kalman.cpp.o [ 29%] Building CXX object modules/highgui/CMakeFiles/opencv_highgui.dir/src/cap_qtkit.mm.o [ 29%] Building CXX object modules/video/CMakeFiles/opencv_video.dir/src/lkpyramid.cpp.o [ 29%] Building CXX object modules/video/CMakeFiles/opencv_video.dir/src/motempl.cpp.o [ 29%] Building CXX object modules/video/CMakeFiles/opencv_video.dir/src/optflowgf.cpp.o Scanning dependencies of target opencv_softcascade [ 30%] Building CXX object modules/highgui/CMakeFiles/opencv_highgui.dir/src/grfmt_base.cpp.o [ 30%] Building CXX object modules/softcascade/CMakeFiles/opencv_softcascade.dir/src/detector.cpp.o [ 30%] Building CXX object modules/softcascade/CMakeFiles/opencv_softcascade.dir/src/detector_cuda.cpp.o [ 30%] Building CXX object modules/highgui/CMakeFiles/opencv_highgui.dir/src/grfmt_bmp.cpp.o [ 30%] Building CXX object modules/video/CMakeFiles/opencv_video.dir/src/precomp.cpp.o [ 30%] Building CXX object modules/highgui/CMakeFiles/opencv_highgui.dir/src/grfmt_exr.cpp.o [ 30%] Building CXX object modules/softcascade/CMakeFiles/opencv_softcascade.dir/src/integral_channel_builder.cpp.o [ 30%] Building CXX object modules/highgui/CMakeFiles/opencv_highgui.dir/src/grfmt_jpeg.cpp.o [ 30%] Building CXX object modules/video/CMakeFiles/opencv_video.dir/src/simpleflow.cpp.o [ 30%] Building CXX object modules/highgui/CMakeFiles/opencv_highgui.dir/src/grfmt_jpeg2000.cpp.o [ 30%] Building CXX object modules/highgui/CMakeFiles/opencv_highgui.dir/src/grfmt_png.cpp.o [ 30%] Building CXX object modules/softcascade/CMakeFiles/opencv_softcascade.dir/src/octave.cpp.o [ 30%] Building CXX object modules/video/CMakeFiles/opencv_video.dir/src/tvl1flow.cpp.o [ 30%] Building CXX object modules/softcascade/CMakeFiles/opencv_softcascade.dir/src/precomp.cpp.o [ 30%] Building CXX object modules/highgui/CMakeFiles/opencv_highgui.dir/src/grfmt_pxm.cpp.o [ 31%] Building CXX object modules/video/CMakeFiles/opencv_video.dir/src/video_init.cpp.o [ 31%] Building CXX object modules/softcascade/CMakeFiles/opencv_softcascade.dir/src/softcascade_init.cpp.o [ 31%] Building CXX object modules/highgui/CMakeFiles/opencv_highgui.dir/src/grfmt_sunras.cpp.o [ 31%] Building CXX object modules/highgui/CMakeFiles/opencv_highgui.dir/src/grfmt_tiff.cpp.o Linking CXX shared library ../../lib/libopencv_video.dylib [ 31%] Built target opencv_video [ 31%] Building CXX object modules/highgui/CMakeFiles/opencv_highgui.dir/src/grfmt_webp.cpp.o Linking CXX shared library ../../lib/libopencv_softcascade.dylib [ 31%] Built target opencv_softcascade [ 31%] Building CXX object modules/highgui/CMakeFiles/opencv_highgui.dir/src/bitstrm.cpp.o Linking CXX shared library ../../lib/libopencv_highgui.dylib [ 31%] Built target opencv_highgui Scanning dependencies of target opencv_features2d Scanning dependencies of target opencv_ts Scanning dependencies of target opencv_objdetect Scanning dependencies of target opencv_sft [ 31%] Building CXX object apps/sft/CMakeFiles/opencv_sft.dir/config.cpp.o [ 31%] Building CXX object modules/ts/CMakeFiles/opencv_ts.dir/src/gpu_perf.cpp.o [ 31%] Building CXX object modules/objdetect/CMakeFiles/opencv_objdetect.dir/src/cascadedetect.cpp.o [ 31%] Building CXX object modules/features2d/CMakeFiles/opencv_features2d.dir/src/bagofwords.cpp.o [ 31%] Building CXX object apps/sft/CMakeFiles/opencv_sft.dir/dataset.cpp.o [ 32%] [ 32%] Building CXX object apps/sft/CMakeFiles/opencv_sft.dir/sft.cpp.o Building CXX object modules/features2d/CMakeFiles/opencv_features2d.dir/src/blobdetector.cpp.o [ 32%] Building CXX object modules/ts/CMakeFiles/opencv_ts.dir/src/gpu_test.cpp.o Linking CXX executable ../../bin/opencv_trainsoftcascade [ 32%] Built target opencv_sft [ 32%] Building CXX object modules/objdetect/CMakeFiles/opencv_objdetect.dir/src/datamatrix.cpp.o [ 32%] Building CXX object modules/features2d/CMakeFiles/opencv_features2d.dir/src/brief.cpp.o [ 33%] Building CXX object modules/objdetect/CMakeFiles/opencv_objdetect.dir/src/distancetransform.cpp.o [ 33%] Building CXX object modules/objdetect/CMakeFiles/opencv_objdetect.dir/src/featurepyramid.cpp.o [ 33%] Building CXX object modules/ts/CMakeFiles/opencv_ts.dir/src/precomp.cpp.o [ 33%] Building CXX object modules/objdetect/CMakeFiles/opencv_objdetect.dir/src/fft.cpp.o [ 33%] Building CXX object modules/objdetect/CMakeFiles/opencv_objdetect.dir/src/haar.cpp.o [ 33%] Building CXX object modules/objdetect/CMakeFiles/opencv_objdetect.dir/src/hog.cpp.o [ 33%] Building CXX object modules/ts/CMakeFiles/opencv_ts.dir/src/ts.cpp.o [ 33%] Building CXX object modules/features2d/CMakeFiles/opencv_features2d.dir/src/brisk.cpp.o [ 33%] Building CXX object modules/objdetect/CMakeFiles/opencv_objdetect.dir/src/latentsvm.cpp.o [ 33%] Building CXX object modules/ts/CMakeFiles/opencv_ts.dir/src/ts_arrtest.cpp.o [ 33%] Building CXX object modules/objdetect/CMakeFiles/opencv_objdetect.dir/src/latentsvmdetector.cpp.o [ 33%] Building CXX object modules/objdetect/CMakeFiles/opencv_objdetect.dir/src/linemod.cpp.o [ 34%] Building CXX object modules/features2d/CMakeFiles/opencv_features2d.dir/src/descriptors.cpp.o [ 34%] Building CXX object modules/objdetect/CMakeFiles/opencv_objdetect.dir/src/lsvmparser.cpp.o [ 34%] Building CXX object modules/ts/CMakeFiles/opencv_ts.dir/src/ts_func.cpp.o [ 34%] Building CXX object modules/features2d/CMakeFiles/opencv_features2d.dir/src/detectors.cpp.o [ 34%] Building CXX object modules/features2d/CMakeFiles/opencv_features2d.dir/src/draw.cpp.o [ 34%] Building CXX object modules/features2d/CMakeFiles/opencv_features2d.dir/src/dynamic.cpp.o [ 34%] Building CXX object modules/objdetect/CMakeFiles/opencv_objdetect.dir/src/lsvmtbbversion.cpp.o [ 34%] Building CXX object modules/features2d/CMakeFiles/opencv_features2d.dir/src/evaluation.cpp.o [ 34%] Building CXX object modules/features2d/CMakeFiles/opencv_features2d.dir/src/fast.cpp.o [ 34%] Building CXX object modules/objdetect/CMakeFiles/opencv_objdetect.dir/src/matching.cpp.o [ 34%] Building CXX object modules/features2d/CMakeFiles/opencv_features2d.dir/src/fast_score.cpp.o [ 34%] Building CXX object modules/objdetect/CMakeFiles/opencv_objdetect.dir/src/precomp.cpp.o [ 34%] Building CXX object modules/ts/CMakeFiles/opencv_ts.dir/src/ts_gtest.cpp.o [ 34%] Building CXX object modules/features2d/CMakeFiles/opencv_features2d.dir/src/features2d_init.cpp.o [ 34%] Building CXX object modules/objdetect/CMakeFiles/opencv_objdetect.dir/src/resizeimg.cpp.o [ 35%] Building CXX object modules/objdetect/CMakeFiles/opencv_objdetect.dir/src/routine.cpp.o [ 35%] Building CXX object modules/ts/CMakeFiles/opencv_ts.dir/src/ts_perf.cpp.o Linking CXX shared library ../../lib/libopencv_objdetect.dylib [ 35%] Built target opencv_objdetect [ 35%] Generating kernels.cpp [ 35%] Building CXX object modules/features2d/CMakeFiles/opencv_features2d.dir/src/freak.cpp.o Scanning dependencies of target opencv_ocl [ 35%] Building CXX object modules/ocl/CMakeFiles/opencv_ocl.dir/src/arithm.cpp.o [ 35%] Building CXX object modules/features2d/CMakeFiles/opencv_features2d.dir/src/keypoint.cpp.o [ 35%] Building CXX object modules/features2d/CMakeFiles/opencv_features2d.dir/src/matchers.cpp.o [ 35%] Building CXX object modules/ocl/CMakeFiles/opencv_ocl.dir/src/blend.cpp.o Linking CXX shared library ../../lib/libopencv_ts.dylib [ 35%] Built target opencv_ts Scanning dependencies of target opencv_perf_core [ 35%] Building CXX object modules/core/CMakeFiles/opencv_perf_core.dir/perf/perf_abs.cpp.o [ 35%] Building CXX object modules/features2d/CMakeFiles/opencv_features2d.dir/src/mser.cpp.o [ 35%] Building CXX object modules/ocl/CMakeFiles/opencv_ocl.dir/src/brute_force_matcher.cpp.o [ 35%] Building CXX object modules/core/CMakeFiles/opencv_perf_core.dir/perf/perf_addWeighted.cpp.o [ 35%] Building CXX object modules/features2d/CMakeFiles/opencv_features2d.dir/src/orb.cpp.o Scanning dependencies of target opencv_test_core [ 35%] Building CXX object modules/core/CMakeFiles/opencv_test_core.dir/test/test_arithm.cpp.o [ 35%] Building CXX object modules/core/CMakeFiles/opencv_perf_core.dir/perf/perf_arithm.cpp.o [ 35%] Building CXX object modules/ocl/CMakeFiles/opencv_ocl.dir/src/build_warps.cpp.o [ 36%] Building CXX object modules/features2d/CMakeFiles/opencv_features2d.dir/src/precomp.cpp.o [ 36%] Building CXX object modules/features2d/CMakeFiles/opencv_features2d.dir/src/stardetector.cpp.o [ 36%] Building CXX object modules/ocl/CMakeFiles/opencv_ocl.dir/src/canny.cpp.o Linking CXX shared library ../../lib/libopencv_features2d.dylib [ 36%] Built target opencv_features2d [ 37%] Building CXX object modules/core/CMakeFiles/opencv_test_core.dir/test/test_countnonzero.cpp.o [ 37%] Building CXX object modules/core/CMakeFiles/opencv_test_core.dir/test/test_ds.cpp.o [ 37%] Building CXX object modules/ocl/CMakeFiles/opencv_ocl.dir/src/color.cpp.o [ 37%] Building CXX object modules/ocl/CMakeFiles/opencv_ocl.dir/src/columnsum.cpp.o [ 37%] Building CXX object modules/core/CMakeFiles/opencv_perf_core.dir/perf/perf_bitwise.cpp.o [ 37%] Building CXX object modules/core/CMakeFiles/opencv_test_core.dir/test/test_dxt.cpp.o [ 37%] Building CXX object modules/ocl/CMakeFiles/opencv_ocl.dir/src/error.cpp.o Scanning dependencies of target opencv_perf_imgproc [ 37%] Building CXX object modules/imgproc/CMakeFiles/opencv_perf_imgproc.dir/perf/perf_bilateral.cpp.o [ 37%] Building CXX object modules/ocl/CMakeFiles/opencv_ocl.dir/src/fft.cpp.o [ 37%] Building CXX object modules/core/CMakeFiles/opencv_test_core.dir/test/test_eigen.cpp.o [ 37%] Building CXX object modules/core/CMakeFiles/opencv_perf_core.dir/perf/perf_compare.cpp.o [ 37%] Building CXX object modules/ocl/CMakeFiles/opencv_ocl.dir/src/filtering.cpp.o [ 37%] Building CXX object modules/imgproc/CMakeFiles/opencv_perf_imgproc.dir/perf/perf_blur.cpp.o [ 37%] Building CXX object modules/core/CMakeFiles/opencv_test_core.dir/test/test_io.cpp.o [ 37%] Building CXX object modules/core/CMakeFiles/opencv_perf_core.dir/perf/perf_convertTo.cpp.o [ 37%] Building CXX object modules/ocl/CMakeFiles/opencv_ocl.dir/src/gemm.cpp.o [ 37%] Building CXX object modules/core/CMakeFiles/opencv_test_core.dir/test/test_main.cpp.o [ 37%] Building CXX object modules/ocl/CMakeFiles/opencv_ocl.dir/src/haar.cpp.o [ 38%] Building CXX object modules/core/CMakeFiles/opencv_perf_core.dir/perf/perf_dft.cpp.o [ 38%] Building CXX object modules/core/CMakeFiles/opencv_test_core.dir/test/test_mat.cpp.o [ 38%] Building CXX object modules/imgproc/CMakeFiles/opencv_perf_imgproc.dir/perf/perf_canny.cpp.o [ 39%] Building CXX object modules/ocl/CMakeFiles/opencv_ocl.dir/src/hog.cpp.o [ 39%] Building CXX object modules/core/CMakeFiles/opencv_perf_core.dir/perf/perf_dot.cpp.o [ 39%] Building CXX object modules/ocl/CMakeFiles/opencv_ocl.dir/src/hough.cpp.o [ 39%] Building CXX object modules/imgproc/CMakeFiles/opencv_perf_imgproc.dir/perf/perf_cornerEigenValsAndVecs.cpp.o [ 39%] Building CXX object modules/core/CMakeFiles/opencv_test_core.dir/test/test_math.cpp.o [ 39%] Building CXX object modules/core/CMakeFiles/opencv_perf_core.dir/perf/perf_inRange.cpp.o [ 39%] Building CXX object modules/ocl/CMakeFiles/opencv_ocl.dir/src/imgproc.cpp.o [ 39%] Building CXX object modules/imgproc/CMakeFiles/opencv_perf_imgproc.dir/perf/perf_cornerHarris.cpp.o [ 39%] Building CXX object modules/core/CMakeFiles/opencv_perf_core.dir/perf/perf_main.cpp.o [ 39%] Building CXX object modules/ocl/CMakeFiles/opencv_ocl.dir/src/initialization.cpp.o [ 39%] Building CXX object modules/core/CMakeFiles/opencv_perf_core.dir/perf/perf_mat.cpp.o [ 39%] Building CXX object modules/ocl/CMakeFiles/opencv_ocl.dir/src/interpolate_frames.cpp.o [ 39%] Building CXX object modules/imgproc/CMakeFiles/opencv_perf_imgproc.dir/perf/perf_cvt_color.cpp.o [ 39%] Building CXX object modules/core/CMakeFiles/opencv_test_core.dir/test/test_misc.cpp.o [ 39%] Building CXX object modules/ocl/CMakeFiles/opencv_ocl.dir/src/match_template.cpp.o [ 39%] Building CXX object modules/core/CMakeFiles/opencv_perf_core.dir/perf/perf_math.cpp.o [ 39%] Building CXX object modules/core/CMakeFiles/opencv_test_core.dir/test/test_operations.cpp.o [ 39%] Building CXX object modules/ocl/CMakeFiles/opencv_ocl.dir/src/matrix_operations.cpp.o [ 39%] Building CXX object modules/core/CMakeFiles/opencv_perf_core.dir/perf/perf_merge.cpp.o [ 39%] Building CXX object modules/ocl/CMakeFiles/opencv_ocl.dir/src/mcwutil.cpp.o [ 39%] Building CXX object modules/imgproc/CMakeFiles/opencv_perf_imgproc.dir/perf/perf_distanceTransform.cpp.o [ 40%] Building CXX object modules/imgproc/CMakeFiles/opencv_perf_imgproc.dir/perf/perf_filter2d.cpp.o [ 40%] Building CXX object modules/ocl/CMakeFiles/opencv_ocl.dir/src/moments.cpp.o [ 40%] Building CXX object modules/core/CMakeFiles/opencv_perf_core.dir/perf/perf_minmaxloc.cpp.o [ 40%] Building CXX object modules/ocl/CMakeFiles/opencv_ocl.dir/src/mssegmentation.cpp.o [ 40%] Building CXX object modules/imgproc/CMakeFiles/opencv_perf_imgproc.dir/perf/perf_goodFeaturesToTrack.cpp.o [ 40%] Building CXX object modules/ocl/CMakeFiles/opencv_ocl.dir/src/precomp.cpp.o [ 40%] Building CXX object modules/core/CMakeFiles/opencv_perf_core.dir/perf/perf_norm.cpp.o [ 40%] Building CXX object modules/ocl/CMakeFiles/opencv_ocl.dir/src/pyrdown.cpp.o [ 40%] Building CXX object modules/imgproc/CMakeFiles/opencv_perf_imgproc.dir/perf/perf_histogram.cpp.o [ 40%] Building CXX object modules/ocl/CMakeFiles/opencv_ocl.dir/src/pyrlk.cpp.o [ 40%] Building CXX object modules/ocl/CMakeFiles/opencv_ocl.dir/src/pyrup.cpp.o [ 40%] Building CXX object modules/core/CMakeFiles/opencv_test_core.dir/test/test_precomp.cpp.o [ 40%] Building CXX object modules/core/CMakeFiles/opencv_perf_core.dir/perf/perf_precomp.cpp.o [ 41%] Building CXX object modules/ocl/CMakeFiles/opencv_ocl.dir/src/split_merge.cpp.o [ 41%] Building CXX object modules/imgproc/CMakeFiles/opencv_perf_imgproc.dir/perf/perf_houghLines.cpp.o [ 41%] Building CXX object modules/core/CMakeFiles/opencv_test_core.dir/test/test_rand.cpp.o [ 41%] Building CXX object modules/core/CMakeFiles/opencv_perf_core.dir/perf/perf_reduce.cpp.o [ 41%] Building CXX object modules/ocl/CMakeFiles/opencv_ocl.dir/src/stereobm.cpp.o Linking CXX executable ../../bin/opencv_test_core [ 41%] Built target opencv_test_core Scanning dependencies of target opencv_test_imgproc [ 41%] Building CXX object modules/ocl/CMakeFiles/opencv_ocl.dir/kernels.cpp.o [ 41%] Building CXX object modules/imgproc/CMakeFiles/opencv_test_imgproc.dir/test/test_approxpoly.cpp.o [ 41%] Building CXX object modules/imgproc/CMakeFiles/opencv_perf_imgproc.dir/perf/perf_integral.cpp.o Linking CXX shared library ../../lib/libopencv_ocl.dylib [ 41%] Built target opencv_ocl Scanning dependencies of target opencv_test_flann [ 41%] Building CXX object modules/flann/CMakeFiles/opencv_test_flann.dir/test/test_lshtable_badarg.cpp.o [ 41%] Building CXX object modules/core/CMakeFiles/opencv_perf_core.dir/perf/perf_split.cpp.o [ 41%] Building CXX object modules/imgproc/CMakeFiles/opencv_test_imgproc.dir/test/test_bilateral_filter.cpp.o [ 41%] Building CXX object modules/flann/CMakeFiles/opencv_test_flann.dir/test/test_main.cpp.o [ 41%] Building CXX object modules/imgproc/CMakeFiles/opencv_perf_imgproc.dir/perf/perf_main.cpp.o [ 41%] Building CXX object modules/imgproc/CMakeFiles/opencv_test_imgproc.dir/test/test_boundingrect.cpp.o [ 41%] Building CXX object modules/core/CMakeFiles/opencv_perf_core.dir/perf/perf_stat.cpp.o [ 41%] Building CXX object modules/flann/CMakeFiles/opencv_test_flann.dir/test/test_precomp.cpp.o [ 41%] Building CXX object modules/imgproc/CMakeFiles/opencv_perf_imgproc.dir/perf/perf_matchTemplate.cpp.o [ 41%] Building CXX object modules/imgproc/CMakeFiles/opencv_test_imgproc.dir/test/test_canny.cpp.o Linking CXX executable ../../bin/opencv_test_flann [ 41%] Built target opencv_test_flann Scanning dependencies of target opencv_perf_highgui [ 41%] Building CXX object modules/highgui/CMakeFiles/opencv_perf_highgui.dir/perf/perf_input.cpp.o [ 41%] Building CXX object modules/imgproc/CMakeFiles/opencv_test_imgproc.dir/test/test_color.cpp.o Linking CXX executable ../../bin/opencv_perf_core [ 41%] Built target opencv_perf_core Scanning dependencies of target opencv_test_highgui [ 41%] Building CXX object modules/highgui/CMakeFiles/opencv_test_highgui.dir/test/test_drawing.cpp.o [ 41%] Building CXX object modules/imgproc/CMakeFiles/opencv_perf_imgproc.dir/perf/perf_morph.cpp.o [ 41%] Building CXX object modules/highgui/CMakeFiles/opencv_perf_highgui.dir/perf/perf_main.cpp.o [ 41%] Building CXX object modules/highgui/CMakeFiles/opencv_perf_highgui.dir/perf/perf_output.cpp.o [ 41%] Building CXX object modules/highgui/CMakeFiles/opencv_test_highgui.dir/test/test_ffmpeg.cpp.o [ 41%] Building CXX object modules/imgproc/CMakeFiles/opencv_perf_imgproc.dir/perf/perf_precomp.cpp.o [ 42%] Building CXX object modules/imgproc/CMakeFiles/opencv_test_imgproc.dir/test/test_connectedcomponents.cpp.o [ 42%] Building CXX object modules/highgui/CMakeFiles/opencv_test_highgui.dir/test/test_fourcc.cpp.o [ 42%] Building CXX object modules/imgproc/CMakeFiles/opencv_perf_imgproc.dir/perf/perf_pyramids.cpp.o [ 42%] Building CXX object modules/highgui/CMakeFiles/opencv_perf_highgui.dir/perf/perf_precomp.cpp.o [ 42%] Building CXX object modules/imgproc/CMakeFiles/opencv_test_imgproc.dir/test/test_contours.cpp.o [ 43%] Building CXX object modules/highgui/CMakeFiles/opencv_test_highgui.dir/test/test_framecount.cpp.o Linking CXX executable ../../bin/opencv_perf_highgui [ 43%] Built target opencv_perf_highgui Scanning dependencies of target opencv_perf_features2d [ 43%] Building CXX object modules/features2d/CMakeFiles/opencv_perf_features2d.dir/perf/perf_batchDistance.cpp.o [ 43%] Building CXX object modules/imgproc/CMakeFiles/opencv_test_imgproc.dir/test/test_convhull.cpp.o [ 43%] Building CXX object modules/imgproc/CMakeFiles/opencv_perf_imgproc.dir/perf/perf_remap.cpp.o [ 43%] Building CXX object modules/highgui/CMakeFiles/opencv_test_highgui.dir/test/test_grfmt.cpp.o [ 43%] Building CXX object modules/imgproc/CMakeFiles/opencv_test_imgproc.dir/test/test_cvtyuv.cpp.o [ 43%] Building CXX object modules/imgproc/CMakeFiles/opencv_perf_imgproc.dir/perf/perf_resize.cpp.o [ 44%] Building CXX object modules/features2d/CMakeFiles/opencv_perf_features2d.dir/perf/perf_fast.cpp.o [ 44%] Building CXX object modules/highgui/CMakeFiles/opencv_test_highgui.dir/test/test_gui.cpp.o [ 44%] Building CXX object modules/imgproc/CMakeFiles/opencv_test_imgproc.dir/test/test_distancetransform.cpp.o [ 44%] Building CXX object modules/highgui/CMakeFiles/opencv_test_highgui.dir/test/test_main.cpp.o [ 44%] Building CXX object modules/features2d/CMakeFiles/opencv_perf_features2d.dir/perf/perf_main.cpp.o [ 44%] Building CXX object modules/imgproc/CMakeFiles/opencv_test_imgproc.dir/test/test_emd.cpp.o [ 44%] Building CXX object modules/imgproc/CMakeFiles/opencv_perf_imgproc.dir/perf/perf_sepfilters.cpp.o [ 44%] Building CXX object modules/highgui/CMakeFiles/opencv_test_highgui.dir/test/test_positioning.cpp.o [ 44%] Building CXX object modules/features2d/CMakeFiles/opencv_perf_features2d.dir/perf/perf_orb.cpp.o [ 44%] Building CXX object modules/imgproc/CMakeFiles/opencv_test_imgproc.dir/test/test_filter.cpp.o [ 44%] Building CXX object modules/highgui/CMakeFiles/opencv_test_highgui.dir/test/test_precomp.cpp.o [ 44%] Building CXX object modules/highgui/CMakeFiles/opencv_test_highgui.dir/test/test_video_io.cpp.o [ 44%] Building CXX object modules/features2d/CMakeFiles/opencv_perf_features2d.dir/perf/perf_precomp.cpp.o [ 44%] Building CXX object modules/imgproc/CMakeFiles/opencv_test_imgproc.dir/test/test_floodfill.cpp.o Linking CXX executable ../../bin/opencv_perf_features2d [ 44%] Built target opencv_perf_features2d Scanning dependencies of target opencv_test_features2d [ 44%] Building CXX object modules/features2d/CMakeFiles/opencv_test_features2d.dir/test/test_brisk.cpp.o [ 44%] Building CXX object modules/highgui/CMakeFiles/opencv_test_highgui.dir/test/test_video_pos.cpp.o [ 44%] Building CXX object modules/imgproc/CMakeFiles/opencv_test_imgproc.dir/test/test_grabcut.cpp.o [ 44%] Building CXX object modules/imgproc/CMakeFiles/opencv_perf_imgproc.dir/perf/perf_threshold.cpp.o [ 44%] Building CXX object modules/features2d/CMakeFiles/opencv_test_features2d.dir/test/test_descriptors_regression.cpp.o Linking CXX executable ../../bin/opencv_test_highgui [ 44%] Built target opencv_test_highgui [ 44%] Building CXX object modules/imgproc/CMakeFiles/opencv_test_imgproc.dir/test/test_histograms.cpp.o Scanning dependencies of target opencv_calib3d [ 44%] Building CXX object modules/calib3d/CMakeFiles/opencv_calib3d.dir/src/calib3d_init.cpp.o [ 45%] Building CXX object modules/features2d/CMakeFiles/opencv_test_features2d.dir/test/test_detectors_regression.cpp.o [ 45%] Building CXX object modules/calib3d/CMakeFiles/opencv_calib3d.dir/src/calibinit.cpp.o [ 45%] Building CXX object modules/imgproc/CMakeFiles/opencv_test_imgproc.dir/test/test_houghLines.cpp.o [ 46%] Building CXX object modules/imgproc/CMakeFiles/opencv_perf_imgproc.dir/perf/perf_warp.cpp.o [ 46%] Building CXX object modules/features2d/CMakeFiles/opencv_test_features2d.dir/test/test_fast.cpp.o [ 46%] Building CXX object modules/calib3d/CMakeFiles/opencv_calib3d.dir/src/calibration.cpp.o [ 46%] Building CXX object modules/imgproc/CMakeFiles/opencv_test_imgproc.dir/test/test_imgwarp.cpp.o [ 46%] Building CXX object modules/features2d/CMakeFiles/opencv_test_features2d.dir/test/test_keypoints.cpp.o [ 46%] Building CXX object modules/imgproc/CMakeFiles/opencv_test_imgproc.dir/test/test_imgwarp_strict.cpp.o [ 46%] Building CXX object modules/features2d/CMakeFiles/opencv_test_features2d.dir/test/test_main.cpp.o Linking CXX executable ../../bin/opencv_perf_imgproc [ 46%] Building CXX object modules/calib3d/CMakeFiles/opencv_calib3d.dir/src/checkchessboard.cpp.o [ 46%] Built target opencv_perf_imgproc Scanning dependencies of target opencv_test_ml [ 46%] Building CXX object modules/ml/CMakeFiles/opencv_test_ml.dir/test/test_emknearestkmeans.cpp.o [ 46%] Building CXX object modules/features2d/CMakeFiles/opencv_test_features2d.dir/test/test_matchers_algorithmic.cpp.o [ 46%] Building CXX object modules/calib3d/CMakeFiles/opencv_calib3d.dir/src/circlesgrid.cpp.o [ 46%] Building CXX object modules/imgproc/CMakeFiles/opencv_test_imgproc.dir/test/test_main.cpp.o [ 46%] Building CXX object modules/ml/CMakeFiles/opencv_test_ml.dir/test/test_gbttest.cpp.o [ 46%] Building CXX object modules/features2d/CMakeFiles/opencv_test_features2d.dir/test/test_mser.cpp.o [ 47%] Building CXX object modules/imgproc/CMakeFiles/opencv_test_imgproc.dir/test/test_moments.cpp.o [ 47%] Building CXX object modules/ml/CMakeFiles/opencv_test_ml.dir/test/test_main.cpp.o [ 47%] Building CXX object modules/calib3d/CMakeFiles/opencv_calib3d.dir/src/compat_ptsetreg.cpp.o [ 47%] Building CXX object modules/features2d/CMakeFiles/opencv_test_features2d.dir/test/test_nearestneighbors.cpp.o [ 47%] Building CXX object modules/imgproc/CMakeFiles/opencv_test_imgproc.dir/test/test_pc.cpp.o [ 47%] Building CXX object modules/calib3d/CMakeFiles/opencv_calib3d.dir/src/compat_stereo.cpp.o [ 47%] Building CXX object modules/ml/CMakeFiles/opencv_test_ml.dir/test/test_mltests.cpp.o [ 47%] Building CXX object modules/imgproc/CMakeFiles/opencv_test_imgproc.dir/test/test_precomp.cpp.o [ 47%] Building CXX object modules/features2d/CMakeFiles/opencv_test_features2d.dir/test/test_orb.cpp.o [ 47%] Building CXX object modules/calib3d/CMakeFiles/opencv_calib3d.dir/src/epnp.cpp.o [ 47%] Building CXX object modules/ml/CMakeFiles/opencv_test_ml.dir/test/test_mltests2.cpp.o [ 47%] Building CXX object modules/imgproc/CMakeFiles/opencv_test_imgproc.dir/test/test_templmatch.cpp.o [ 48%] Building CXX object modules/calib3d/CMakeFiles/opencv_calib3d.dir/src/five-point.cpp.o [ 48%] Building CXX object modules/features2d/CMakeFiles/opencv_test_features2d.dir/test/test_precomp.cpp.o [ 48%] Building CXX object modules/ml/CMakeFiles/opencv_test_ml.dir/test/test_precomp.cpp.o [ 48%] Building CXX object modules/imgproc/CMakeFiles/opencv_test_imgproc.dir/test/test_thresh.cpp.o [ 48%] Building CXX object modules/features2d/CMakeFiles/opencv_test_features2d.dir/test/test_rotation_and_scale_invariance.cpp.o [ 48%] Building CXX object modules/ml/CMakeFiles/opencv_test_ml.dir/test/test_save_load.cpp.o [ 48%] Building CXX object modules/imgproc/CMakeFiles/opencv_test_imgproc.dir/test/test_watershed.cpp.o Linking CXX executable ../../bin/opencv_test_features2d [ 48%] Built target opencv_test_features2d Scanning dependencies of target opencv_perf_video [ 49%] Building CXX object modules/video/CMakeFiles/opencv_perf_video.dir/perf/perf_ecc.cpp.o Linking CXX executable ../../bin/opencv_test_ml [ 49%] Built target opencv_test_ml Scanning dependencies of target opencv_test_video [ 49%] Building CXX object modules/video/CMakeFiles/opencv_test_video.dir/test/test_accum.cpp.o Linking CXX executable ../../bin/opencv_test_imgproc [ 49%] Built target opencv_test_imgproc Scanning dependencies of target opencv_perf_objdetect [ 49%] Building CXX object modules/objdetect/CMakeFiles/opencv_perf_objdetect.dir/perf/perf_cascadeclassifier.cpp.o [ 49%] Building CXX object modules/calib3d/CMakeFiles/opencv_calib3d.dir/src/fundam.cpp.o [ 50%] Building CXX object modules/video/CMakeFiles/opencv_test_video.dir/test/test_backgroundsubtractor_gbh.cpp.o [ 50%] Building CXX object modules/video/CMakeFiles/opencv_perf_video.dir/perf/perf_main.cpp.o [ 50%] Building CXX object modules/objdetect/CMakeFiles/opencv_perf_objdetect.dir/perf/perf_main.cpp.o [ 50%] Building CXX object modules/calib3d/CMakeFiles/opencv_calib3d.dir/src/levmarq.cpp.o [ 50%] Building CXX object modules/video/CMakeFiles/opencv_test_video.dir/test/test_camshift.cpp.o [ 50%] Building CXX object modules/video/CMakeFiles/opencv_perf_video.dir/perf/perf_optflowpyrlk.cpp.o [ 50%] Building CXX object modules/objdetect/CMakeFiles/opencv_perf_objdetect.dir/perf/perf_precomp.cpp.o [ 50%] Building CXX object modules/calib3d/CMakeFiles/opencv_calib3d.dir/src/p3p.cpp.o [ 50%] Building CXX object modules/video/CMakeFiles/opencv_test_video.dir/test/test_ecc.cpp.o Linking CXX executable ../../bin/opencv_perf_objdetect [ 50%] Built target opencv_perf_objdetect Scanning dependencies of target opencv_test_objdetect [ 50%] Building CXX object modules/objdetect/CMakeFiles/opencv_test_objdetect.dir/test/test_cascadeandhog.cpp.o [ 50%] Building CXX object modules/calib3d/CMakeFiles/opencv_calib3d.dir/src/polynom_solver.cpp.o [ 50%] Building CXX object modules/calib3d/CMakeFiles/opencv_calib3d.dir/src/posit.cpp.o [ 50%] Building CXX object modules/video/CMakeFiles/opencv_test_video.dir/test/test_estimaterigid.cpp.o [ 50%] Building CXX object modules/calib3d/CMakeFiles/opencv_calib3d.dir/src/precomp.cpp.o [ 50%] Building CXX object modules/video/CMakeFiles/opencv_perf_video.dir/perf/perf_precomp.cpp.o [ 50%] Building CXX object modules/calib3d/CMakeFiles/opencv_calib3d.dir/src/ptsetreg.cpp.o [ 50%] Building CXX object modules/video/CMakeFiles/opencv_test_video.dir/test/test_kalman.cpp.o [ 50%] Building CXX object modules/objdetect/CMakeFiles/opencv_test_objdetect.dir/test/test_latentsvmdetector.cpp.o [ 50%] Building CXX object modules/video/CMakeFiles/opencv_perf_video.dir/perf/perf_tvl1optflow.cpp.o [ 50%] Building CXX object modules/video/CMakeFiles/opencv_test_video.dir/test/test_main.cpp.o [ 50%] Building CXX object modules/calib3d/CMakeFiles/opencv_calib3d.dir/src/quadsubpix.cpp.o [ 50%] Building CXX object modules/objdetect/CMakeFiles/opencv_test_objdetect.dir/test/test_main.cpp.o [ 50%] Building CXX object modules/calib3d/CMakeFiles/opencv_calib3d.dir/src/solvepnp.cpp.o Linking CXX executable ../../bin/opencv_perf_video [ 50%] Built target opencv_perf_video Scanning dependencies of target opencv_perf_photo [ 50%] Building CXX object modules/video/CMakeFiles/opencv_test_video.dir/test/test_motiontemplates.cpp.o [ 50%] Building CXX object modules/photo/CMakeFiles/opencv_perf_photo.dir/perf/perf_inpaint.cpp.o [ 50%] Building CXX object modules/objdetect/CMakeFiles/opencv_test_objdetect.dir/test/test_precomp.cpp.o [ 50%] Building CXX object modules/calib3d/CMakeFiles/opencv_calib3d.dir/src/stereobm.cpp.o [ 50%] Building CXX object modules/video/CMakeFiles/opencv_test_video.dir/test/test_optflowpyrlk.cpp.o Linking CXX executable ../../bin/opencv_test_objdetect [ 50%] Built target opencv_test_objdetect Scanning dependencies of target opencv_test_photo [ 50%] Building CXX object modules/photo/CMakeFiles/opencv_test_photo.dir/test/test_denoising.cpp.o [ 50%] Building CXX object modules/photo/CMakeFiles/opencv_perf_photo.dir/perf/perf_main.cpp.o [ 50%] Building CXX object modules/calib3d/CMakeFiles/opencv_calib3d.dir/src/stereosgbm.cpp.o [ 50%] Building CXX object modules/video/CMakeFiles/opencv_test_video.dir/test/test_precomp.cpp.o [ 50%] Building CXX object modules/photo/CMakeFiles/opencv_perf_photo.dir/perf/perf_precomp.cpp.o [ 50%] Building CXX object modules/photo/CMakeFiles/opencv_test_photo.dir/test/test_inpaint.cpp.o [ 50%] Building CXX object modules/video/CMakeFiles/opencv_test_video.dir/test/test_simpleflow.cpp.o [ 50%] Building CXX object modules/calib3d/CMakeFiles/opencv_calib3d.dir/src/triangulate.cpp.o Linking CXX executable ../../bin/opencv_perf_photo [ 50%] Built target opencv_perf_photo [ 50%] Building CXX object modules/photo/CMakeFiles/opencv_test_photo.dir/test/test_main.cpp.o [ 50%] Building CXX object modules/video/CMakeFiles/opencv_test_video.dir/test/test_tvl1optflow.cpp.o Scanning dependencies of target opencv_perf_ocl Linking CXX shared library ../../lib/libopencv_calib3d.dylib [ 50%] Building CXX object modules/ocl/CMakeFiles/opencv_perf_ocl.dir/perf/main.cpp.o [ 50%] Built target opencv_calib3d Scanning dependencies of target opencv_test_ocl [ 50%] Building CXX object modules/ocl/CMakeFiles/opencv_test_ocl.dir/test/main.cpp.o [ 50%] Building CXX object modules/photo/CMakeFiles/opencv_test_photo.dir/test/test_precomp.cpp.o Linking CXX executable ../../bin/opencv_test_video [ 50%] Built target opencv_test_video Scanning dependencies of target opencv_perf_softcascade [ 50%] Building CXX object modules/softcascade/CMakeFiles/opencv_perf_softcascade.dir/perf/perf_cuda_softcascade.cpp.o Linking CXX executable ../../bin/opencv_test_photo [ 50%] Building CXX object modules/ocl/CMakeFiles/opencv_perf_ocl.dir/perf/perf_arithm.cpp.o [ 50%] Built target opencv_test_photo Scanning dependencies of target opencv_test_softcascade [ 50%] Building CXX object modules/softcascade/CMakeFiles/opencv_test_softcascade.dir/test/test_channel_features.cpp.o [ 50%] Building CXX object modules/ocl/CMakeFiles/opencv_test_ocl.dir/test/precomp.cpp.o [ 50%] Building CXX object modules/softcascade/CMakeFiles/opencv_test_softcascade.dir/test/test_cuda_softcascade.cpp.o [ 51%] Building CXX object modules/ocl/CMakeFiles/opencv_test_ocl.dir/test/test_arithm.cpp.o [ 51%] Building CXX object modules/softcascade/CMakeFiles/opencv_perf_softcascade.dir/perf/perf_main.cpp.o [ 51%] Building CXX object modules/softcascade/CMakeFiles/opencv_perf_softcascade.dir/perf/perf_precomp.cpp.o [ 52%] Building CXX object modules/softcascade/CMakeFiles/opencv_test_softcascade.dir/test/test_main.cpp.o [ 52%] Building CXX object modules/softcascade/CMakeFiles/opencv_perf_softcascade.dir/perf/perf_softcascade.cpp.o [ 52%] Building CXX object modules/softcascade/CMakeFiles/opencv_test_softcascade.dir/test/test_precomp.cpp.o [ 52%] Building CXX object modules/softcascade/CMakeFiles/opencv_test_softcascade.dir/test/test_softcascade.cpp.o Linking CXX executable ../../bin/opencv_perf_softcascade [ 52%] Built target opencv_perf_softcascade Scanning dependencies of target opencv_perf_calib3d [ 52%] Building CXX object modules/calib3d/CMakeFiles/opencv_perf_calib3d.dir/perf/perf_cicrlesGrid.cpp.o [ 52%] Building CXX object modules/softcascade/CMakeFiles/opencv_test_softcascade.dir/test/test_training.cpp.o [ 52%] Building CXX object modules/calib3d/CMakeFiles/opencv_perf_calib3d.dir/perf/perf_main.cpp.o [ 52%] Building CXX object modules/ocl/CMakeFiles/opencv_perf_ocl.dir/perf/perf_blend.cpp.o [ 52%] Building CXX object modules/softcascade/CMakeFiles/opencv_test_softcascade.dir/test/utility.cpp.o [ 52%] Building CXX object modules/calib3d/CMakeFiles/opencv_perf_calib3d.dir/perf/perf_pnp.cpp.o [ 52%] Building CXX object modules/ocl/CMakeFiles/opencv_perf_ocl.dir/perf/perf_canny.cpp.o Linking CXX executable ../../bin/opencv_test_softcascade [ 52%] Built target opencv_test_softcascade Scanning dependencies of target opencv_test_calib3d [ 52%] Building CXX object modules/calib3d/CMakeFiles/opencv_test_calib3d.dir/test/test_affine3.cpp.o [ 52%] Building CXX object modules/ocl/CMakeFiles/opencv_test_ocl.dir/test/test_blend.cpp.o [ 52%] Building CXX object modules/calib3d/CMakeFiles/opencv_perf_calib3d.dir/perf/perf_precomp.cpp.o [ 52%] Building CXX object modules/ocl/CMakeFiles/opencv_perf_ocl.dir/perf/perf_columnsum.cpp.o [ 52%] Building CXX object modules/calib3d/CMakeFiles/opencv_test_calib3d.dir/test/test_affine3d_estimator.cpp.o Linking CXX executable ../../bin/opencv_perf_calib3d [ 52%] Built target opencv_perf_calib3d [ 52%] Building CXX object modules/ocl/CMakeFiles/opencv_test_ocl.dir/test/test_brute_force_matcher.cpp.o [ 53%] Building CXX object modules/ocl/CMakeFiles/opencv_perf_ocl.dir/perf/perf_fft.cpp.o [ 53%] Building CXX object modules/calib3d/CMakeFiles/opencv_test_calib3d.dir/test/test_cameracalibration.cpp.o [ 53%] Building CXX object modules/ocl/CMakeFiles/opencv_test_ocl.dir/test/test_calib3d.cpp.o [ 53%] Building CXX object modules/ocl/CMakeFiles/opencv_perf_ocl.dir/perf/perf_filters.cpp.o Scanning dependencies of target opencv_contrib [ 54%] Building CXX object modules/contrib/CMakeFiles/opencv_contrib.dir/src/adaptiveskindetector.cpp.o [ 54%] Building CXX object modules/ocl/CMakeFiles/opencv_test_ocl.dir/test/test_canny.cpp.o [ 54%] Building CXX object modules/contrib/CMakeFiles/opencv_contrib.dir/src/ba.cpp.o [ 54%] Building CXX object modules/calib3d/CMakeFiles/opencv_test_calib3d.dir/test/test_cameracalibration_artificial.cpp.o [ 54%] Building CXX object modules/ocl/CMakeFiles/opencv_test_ocl.dir/test/test_color.cpp.o [ 54%] Building CXX object modules/contrib/CMakeFiles/opencv_contrib.dir/src/basicretinafilter.cpp.o [ 54%] Building CXX object modules/calib3d/CMakeFiles/opencv_test_calib3d.dir/test/test_cameracalibration_badarg.cpp.o [ 54%] Building CXX object modules/contrib/CMakeFiles/opencv_contrib.dir/src/bowmsctrainer.cpp.o [ 54%] Building CXX object modules/ocl/CMakeFiles/opencv_perf_ocl.dir/perf/perf_gemm.cpp.o [ 54%] Building CXX object modules/contrib/CMakeFiles/opencv_contrib.dir/src/chamfermatching.cpp.o [ 54%] Building CXX object modules/ocl/CMakeFiles/opencv_perf_ocl.dir/perf/perf_haar.cpp.o [ 54%] Building CXX object modules/calib3d/CMakeFiles/opencv_test_calib3d.dir/test/test_chessboardgenerator.cpp.o [ 54%] Building CXX object modules/ocl/CMakeFiles/opencv_test_ocl.dir/test/test_columnsum.cpp.o [ 54%] Building CXX object modules/contrib/CMakeFiles/opencv_contrib.dir/src/chowliutree.cpp.o [ 54%] Building CXX object modules/ocl/CMakeFiles/opencv_perf_ocl.dir/perf/perf_hog.cpp.o [ 54%] Building CXX object modules/calib3d/CMakeFiles/opencv_test_calib3d.dir/test/test_chesscorners.cpp.o [ 54%] Building CXX object modules/ocl/CMakeFiles/opencv_test_ocl.dir/test/test_fft.cpp.o [ 54%] Building CXX object modules/contrib/CMakeFiles/opencv_contrib.dir/src/colormap.cpp.o [ 54%] Building CXX object modules/ocl/CMakeFiles/opencv_perf_ocl.dir/perf/perf_hough.cpp.o [ 54%] Building CXX object modules/calib3d/CMakeFiles/opencv_test_calib3d.dir/test/test_chesscorners_badarg.cpp.o [ 54%] Building CXX object modules/ocl/CMakeFiles/opencv_test_ocl.dir/test/test_filters.cpp.o [ 54%] Building CXX object modules/contrib/CMakeFiles/opencv_contrib.dir/src/colortracker.cpp.o [ 54%] Building CXX object modules/calib3d/CMakeFiles/opencv_test_calib3d.dir/test/test_chesscorners_timing.cpp.o [ 54%] Building CXX object modules/ocl/CMakeFiles/opencv_perf_ocl.dir/perf/perf_imgproc.cpp.o [ 54%] Building CXX object modules/contrib/CMakeFiles/opencv_contrib.dir/src/contrib_init.cpp.o [ 54%] Building CXX object modules/calib3d/CMakeFiles/opencv_test_calib3d.dir/test/test_compose_rt.cpp.o [ 54%] Building CXX object modules/contrib/CMakeFiles/opencv_contrib.dir/src/detection_based_tracker.cpp.o [ 54%] Building CXX object modules/contrib/CMakeFiles/opencv_contrib.dir/src/facerec.cpp.o [ 54%] Building CXX object modules/calib3d/CMakeFiles/opencv_test_calib3d.dir/test/test_cornerssubpix.cpp.o [ 54%] Building CXX object modules/ocl/CMakeFiles/opencv_test_ocl.dir/test/test_gemm.cpp.o [ 54%] Building CXX object modules/calib3d/CMakeFiles/opencv_test_calib3d.dir/test/test_fundam.cpp.o [ 54%] Building CXX object modules/contrib/CMakeFiles/opencv_contrib.dir/src/featuretracker.cpp.o [ 54%] Building CXX object modules/ocl/CMakeFiles/opencv_test_ocl.dir/test/test_haar.cpp.o [ 54%] Building CXX object modules/contrib/CMakeFiles/opencv_contrib.dir/src/fuzzymeanshifttracker.cpp.o [ 54%] Building CXX object modules/ocl/CMakeFiles/opencv_test_ocl.dir/test/test_hog.cpp.o [ 54%] Building CXX object modules/calib3d/CMakeFiles/opencv_test_calib3d.dir/test/test_homography.cpp.o [ 54%] Building CXX object modules/contrib/CMakeFiles/opencv_contrib.dir/src/gencolors.cpp.o [ 55%] Building CXX object modules/contrib/CMakeFiles/opencv_contrib.dir/src/hybridtracker.cpp.o [ 55%] Building CXX object modules/ocl/CMakeFiles/opencv_test_ocl.dir/test/test_hough.cpp.o [ 56%] Building CXX object modules/calib3d/CMakeFiles/opencv_test_calib3d.dir/test/test_main.cpp.o [ 56%] Building CXX object modules/ocl/CMakeFiles/opencv_perf_ocl.dir/perf/perf_match_template.cpp.o [ 56%] Building CXX object modules/contrib/CMakeFiles/opencv_contrib.dir/src/imagelogpolprojection.cpp.o [ 56%] Building CXX object modules/calib3d/CMakeFiles/opencv_test_calib3d.dir/test/test_modelest.cpp.o [ 56%] Building CXX object modules/ocl/CMakeFiles/opencv_test_ocl.dir/test/test_imgproc.cpp.o [ 56%] Building CXX object modules/contrib/CMakeFiles/opencv_contrib.dir/src/inputoutput.cpp.o [ 56%] Building CXX object modules/calib3d/CMakeFiles/opencv_test_calib3d.dir/test/test_posit.cpp.o [ 56%] Building CXX object modules/ocl/CMakeFiles/opencv_perf_ocl.dir/perf/perf_matrix_operation.cpp.o [ 56%] Building CXX object modules/contrib/CMakeFiles/opencv_contrib.dir/src/lda.cpp.o [ 56%] Building CXX object modules/calib3d/CMakeFiles/opencv_test_calib3d.dir/test/test_precomp.cpp.o [ 56%] Building CXX object modules/contrib/CMakeFiles/opencv_contrib.dir/src/logpolar_bsm.cpp.o [ 56%] Building CXX object modules/calib3d/CMakeFiles/opencv_test_calib3d.dir/test/test_reproject_image_to_3d.cpp.o [ 56%] Building CXX object modules/ocl/CMakeFiles/opencv_perf_ocl.dir/perf/perf_pyrdown.cpp.o [ 56%] Building CXX object modules/contrib/CMakeFiles/opencv_contrib.dir/src/magnoretinafilter.cpp.o [ 56%] Building CXX object modules/calib3d/CMakeFiles/opencv_test_calib3d.dir/test/test_solvepnp_ransac.cpp.o [ 56%] Building CXX object modules/ocl/CMakeFiles/opencv_perf_ocl.dir/perf/perf_pyrup.cpp.o [ 56%] Building CXX object modules/contrib/CMakeFiles/opencv_contrib.dir/src/octree.cpp.o [ 56%] Building CXX object modules/contrib/CMakeFiles/opencv_contrib.dir/src/openfabmap.cpp.o [ 56%] Building CXX object modules/calib3d/CMakeFiles/opencv_test_calib3d.dir/test/test_stereomatching.cpp.o [ 56%] Building CXX object modules/ocl/CMakeFiles/opencv_perf_ocl.dir/perf/perf_split_merge.cpp.o [ 56%] Building CXX object modules/contrib/CMakeFiles/opencv_contrib.dir/src/parvoretinafilter.cpp.o [ 56%] Building CXX object modules/calib3d/CMakeFiles/opencv_test_calib3d.dir/test/test_undistort.cpp.o [ 56%] Building CXX object modules/contrib/CMakeFiles/opencv_contrib.dir/src/polyfit.cpp.o [ 57%] Building CXX object modules/ocl/CMakeFiles/opencv_test_ocl.dir/test/test_match_template.cpp.o [ 57%] Building CXX object modules/ocl/CMakeFiles/opencv_perf_ocl.dir/perf/precomp.cpp.o [ 57%] Building CXX object modules/contrib/CMakeFiles/opencv_contrib.dir/src/precomp.cpp.o [ 57%] Building CXX object modules/calib3d/CMakeFiles/opencv_test_calib3d.dir/test/test_undistort_badarg.cpp.o [ 58%] Building CXX object modules/ocl/CMakeFiles/opencv_perf_ocl.dir/perf/utility.cpp.o [ 58%] Building CXX object modules/contrib/CMakeFiles/opencv_contrib.dir/src/retina.cpp.o [ 58%] Building CXX object modules/ocl/CMakeFiles/opencv_test_ocl.dir/test/test_matrix_operation.cpp.o Linking CXX executable ../../bin/opencv_perf_ocl [ 58%] Built target opencv_perf_ocl Scanning dependencies of target opencv_legacy [ 58%] Building CXX object modules/calib3d/CMakeFiles/opencv_test_calib3d.dir/test/test_undistort_points.cpp.o [ 58%] Building CXX object modules/contrib/CMakeFiles/opencv_contrib.dir/src/retinacolor.cpp.o [ 58%] Building CXX object modules/legacy/CMakeFiles/opencv_legacy.dir/src/3dtracker.cpp.o Linking CXX executable ../../bin/opencv_test_calib3d [ 58%] Built target opencv_test_calib3d [ 58%] Building CXX object modules/ocl/CMakeFiles/opencv_test_ocl.dir/test/test_moments.cpp.o [ 58%] Building CXX object modules/contrib/CMakeFiles/opencv_contrib.dir/src/retinafilter.cpp.o [ 58%] Building CXX object modules/legacy/CMakeFiles/opencv_legacy.dir/src/auxutils.cpp.o [ 59%] Building CXX object modules/contrib/CMakeFiles/opencv_contrib.dir/src/rgbdodometry.cpp.o [ 59%] Building CXX object modules/legacy/CMakeFiles/opencv_legacy.dir/src/bgfg_acmmm2003.cpp.o [ 59%] Building CXX object modules/ocl/CMakeFiles/opencv_test_ocl.dir/test/test_pyrdown.cpp.o [ 59%] Building CXX object modules/ocl/CMakeFiles/opencv_test_ocl.dir/test/test_pyrlk.cpp.o [ 59%] Building CXX object modules/legacy/CMakeFiles/opencv_legacy.dir/src/bgfg_codebook.cpp.o [ 59%] Building CXX object modules/legacy/CMakeFiles/opencv_legacy.dir/src/bgfg_common.cpp.o [ 59%] Building CXX object modules/contrib/CMakeFiles/opencv_contrib.dir/src/selfsimilarity.cpp.o [ 59%] Building CXX object modules/ocl/CMakeFiles/opencv_test_ocl.dir/test/test_pyrup.cpp.o [ 59%] Building CXX object modules/legacy/CMakeFiles/opencv_legacy.dir/src/bgfg_estimation.cpp.o [ 60%] Building CXX object modules/legacy/CMakeFiles/opencv_legacy.dir/src/bgfg_gaussmix.cpp.o [ 60%] Building CXX object modules/legacy/CMakeFiles/opencv_legacy.dir/src/blobtrack.cpp.o [ 60%] Building CXX object modules/legacy/CMakeFiles/opencv_legacy.dir/src/blobtrackanalysis.cpp.o [ 60%] Building CXX object modules/ocl/CMakeFiles/opencv_test_ocl.dir/test/test_split_merge.cpp.o [ 60%] Building CXX object modules/legacy/CMakeFiles/opencv_legacy.dir/src/blobtrackanalysishist.cpp.o [ 60%] Building CXX object modules/contrib/CMakeFiles/opencv_contrib.dir/src/spinimages.cpp.o [ 60%] Building CXX object modules/contrib/CMakeFiles/opencv_contrib.dir/src/stereovar.cpp.o [ 60%] Building CXX object modules/legacy/CMakeFiles/opencv_legacy.dir/src/blobtrackanalysisior.cpp.o [ 60%] Building CXX object modules/legacy/CMakeFiles/opencv_legacy.dir/src/blobtrackanalysistrackdist.cpp.o [ 60%] Building CXX object modules/ocl/CMakeFiles/opencv_test_ocl.dir/test/utility.cpp.o [ 60%] Building CXX object modules/legacy/CMakeFiles/opencv_legacy.dir/src/blobtrackgen1.cpp.o Linking CXX shared library ../../lib/libopencv_contrib.dylib [ 60%] Built target opencv_contrib [ 60%] Building CXX object modules/legacy/CMakeFiles/opencv_legacy.dir/src/blobtrackgenyml.cpp.o Scanning dependencies of target opencv_test_contrib [ 60%] Building CXX object modules/contrib/CMakeFiles/opencv_test_contrib.dir/test/test_main.cpp.o Linking CXX executable ../../bin/opencv_test_ocl [ 60%] Built target opencv_test_ocl [ 60%] Building CXX object modules/legacy/CMakeFiles/opencv_legacy.dir/src/blobtrackingauto.cpp.o [ 60%] Building CXX object modules/legacy/CMakeFiles/opencv_legacy.dir/src/blobtrackingcc.cpp.o [ 60%] Building CXX object modules/contrib/CMakeFiles/opencv_test_contrib.dir/test/test_precomp.cpp.o [ 60%] Building CXX object modules/legacy/CMakeFiles/opencv_legacy.dir/src/blobtrackingccwithcr.cpp.o [ 60%] Building CXX object modules/legacy/CMakeFiles/opencv_legacy.dir/src/blobtrackinglist.cpp.o [ 60%] Building CXX object modules/legacy/CMakeFiles/opencv_legacy.dir/src/blobtrackingmsfg.cpp.o Linking CXX executable ../../bin/opencv_test_contrib [ 60%] Built target opencv_test_contrib [ 60%] Building CXX object modules/legacy/CMakeFiles/opencv_legacy.dir/src/blobtrackingmsfgs.cpp.o [ 61%] Building CXX object modules/legacy/CMakeFiles/opencv_legacy.dir/src/blobtrackpostprockalman.cpp.o [ 61%] Building CXX object modules/legacy/CMakeFiles/opencv_legacy.dir/src/blobtrackpostproclinear.cpp.o [ 61%] Building CXX object modules/legacy/CMakeFiles/opencv_legacy.dir/src/blobtrackpostproclist.cpp.o [ 61%] Building CXX object modules/legacy/CMakeFiles/opencv_legacy.dir/src/calcimagehomography.cpp.o [ 61%] Building CXX object modules/legacy/CMakeFiles/opencv_legacy.dir/src/calibfilter.cpp.o [ 61%] Building CXX object modules/legacy/CMakeFiles/opencv_legacy.dir/src/calonder.cpp.o [ 61%] Building CXX object modules/legacy/CMakeFiles/opencv_legacy.dir/src/camshift.cpp.o [ 61%] Building CXX object modules/legacy/CMakeFiles/opencv_legacy.dir/src/clique.cpp.o [ 61%] Building CXX object modules/legacy/CMakeFiles/opencv_legacy.dir/src/compat.cpp.o [ 61%] Building CXX object modules/legacy/CMakeFiles/opencv_legacy.dir/src/condens.cpp.o [ 61%] Building CXX object modules/legacy/CMakeFiles/opencv_legacy.dir/src/contourtree.cpp.o [ 61%] Building CXX object modules/legacy/CMakeFiles/opencv_legacy.dir/src/correspond.cpp.o [ 61%] Building CXX object modules/legacy/CMakeFiles/opencv_legacy.dir/src/corrimages.cpp.o [ 61%] Building CXX object modules/legacy/CMakeFiles/opencv_legacy.dir/src/createhandmask.cpp.o [ 61%] [ 62%] Building CXX object modules/legacy/CMakeFiles/opencv_legacy.dir/src/dominants.cpp.o Building CXX object modules/legacy/CMakeFiles/opencv_legacy.dir/src/decomppoly.cpp.o [ 62%] Building CXX object modules/legacy/CMakeFiles/opencv_legacy.dir/src/dpstereo.cpp.o [ 62%] Building CXX object modules/legacy/CMakeFiles/opencv_legacy.dir/src/eigenobjects.cpp.o [ 62%] Building CXX object modules/legacy/CMakeFiles/opencv_legacy.dir/src/em.cpp.o [ 62%] Building CXX object modules/legacy/CMakeFiles/opencv_legacy.dir/src/enmin.cpp.o [ 62%] Building CXX object modules/legacy/CMakeFiles/opencv_legacy.dir/src/enteringblobdetection.cpp.o [ 62%] Building CXX object modules/legacy/CMakeFiles/opencv_legacy.dir/src/enteringblobdetectionreal.cpp.o [ 62%] Building CXX object modules/legacy/CMakeFiles/opencv_legacy.dir/src/epilines.cpp.o [ 62%] Building CXX object modules/legacy/CMakeFiles/opencv_legacy.dir/src/extendededges.cpp.o [ 62%] Building CXX object modules/legacy/CMakeFiles/opencv_legacy.dir/src/face.cpp.o [ 62%] Building CXX object modules/legacy/CMakeFiles/opencv_legacy.dir/src/facedetection.cpp.o [ 62%] Building CXX object modules/legacy/CMakeFiles/opencv_legacy.dir/src/facetemplate.cpp.o [ 63%] Building CXX object modules/legacy/CMakeFiles/opencv_legacy.dir/src/features2d.cpp.o [ 63%] Building CXX object modules/legacy/CMakeFiles/opencv_legacy.dir/src/featuretree.cpp.o [ 63%] Building CXX object modules/legacy/CMakeFiles/opencv_legacy.dir/src/findface.cpp.o [ 63%] Building CXX object modules/legacy/CMakeFiles/opencv_legacy.dir/src/findhandregion.cpp.o [ 63%] Building CXX object modules/legacy/CMakeFiles/opencv_legacy.dir/src/hmm.cpp.o [ 63%] Building CXX object modules/legacy/CMakeFiles/opencv_legacy.dir/src/hmm1d.cpp.o [ 63%] Building CXX object modules/legacy/CMakeFiles/opencv_legacy.dir/src/hmmobs.cpp.o [ 63%] Building CXX object modules/legacy/CMakeFiles/opencv_legacy.dir/src/image.cpp.o [ 63%] Building CXX object modules/legacy/CMakeFiles/opencv_legacy.dir/src/kdtree.cpp.o [ 63%] Building CXX object modules/legacy/CMakeFiles/opencv_legacy.dir/src/lcm.cpp.o [ 63%] Building CXX object modules/legacy/CMakeFiles/opencv_legacy.dir/src/lee.cpp.o [ 63%] Building CXX object modules/legacy/CMakeFiles/opencv_legacy.dir/src/levmar.cpp.o [ 63%] Building CXX object modules/legacy/CMakeFiles/opencv_legacy.dir/src/levmarprojbandle.cpp.o [ 63%] Building CXX object modules/legacy/CMakeFiles/opencv_legacy.dir/src/levmartrif.cpp.o [ 64%] Building CXX object modules/legacy/CMakeFiles/opencv_legacy.dir/src/lines.cpp.o [ 64%] Building CXX object modules/legacy/CMakeFiles/opencv_legacy.dir/src/lmeds.cpp.o [ 64%] Building CXX object modules/legacy/CMakeFiles/opencv_legacy.dir/src/lsh.cpp.o [ 64%] Building CXX object modules/legacy/CMakeFiles/opencv_legacy.dir/src/morphcontours.cpp.o [ 64%] Building CXX object modules/legacy/CMakeFiles/opencv_legacy.dir/src/morphing.cpp.o [ 64%] Building CXX object modules/legacy/CMakeFiles/opencv_legacy.dir/src/oneway.cpp.o [ 64%] Building CXX object modules/legacy/CMakeFiles/opencv_legacy.dir/src/optflowbm.cpp.o [ 64%] Building CXX object modules/legacy/CMakeFiles/opencv_legacy.dir/src/optflowhs.cpp.o [ 64%] Building CXX object modules/legacy/CMakeFiles/opencv_legacy.dir/src/optflowlk.cpp.o [ 64%] Building CXX object modules/legacy/CMakeFiles/opencv_legacy.dir/src/pgh.cpp.o [ 64%] Building CXX object modules/legacy/CMakeFiles/opencv_legacy.dir/src/planardetect.cpp.o [ 64%] Building CXX object modules/legacy/CMakeFiles/opencv_legacy.dir/src/precomp.cpp.o [ 64%] Building CXX object modules/legacy/CMakeFiles/opencv_legacy.dir/src/prewarp.cpp.o [ 64%] Building CXX object modules/legacy/CMakeFiles/opencv_legacy.dir/src/pyrsegmentation.cpp.o [ 65%] Building CXX object modules/legacy/CMakeFiles/opencv_legacy.dir/src/scanlines.cpp.o [ 65%] Building CXX object modules/legacy/CMakeFiles/opencv_legacy.dir/src/segment.cpp.o [ 65%] Building CXX object modules/legacy/CMakeFiles/opencv_legacy.dir/src/snakes.cpp.o [ 65%] Building CXX object modules/legacy/CMakeFiles/opencv_legacy.dir/src/spilltree.cpp.o [ 65%] Building CXX object modules/legacy/CMakeFiles/opencv_legacy.dir/src/stereogc.cpp.o [ 65%] Building CXX object modules/legacy/CMakeFiles/opencv_legacy.dir/src/subdiv2.cpp.o [ 65%] Building CXX object modules/legacy/CMakeFiles/opencv_legacy.dir/src/testseq.cpp.o [ 65%] Building CXX object modules/legacy/CMakeFiles/opencv_legacy.dir/src/texture.cpp.o [ 65%] Building CXX object modules/legacy/CMakeFiles/opencv_legacy.dir/src/trifocal.cpp.o [ 65%] Building CXX object modules/legacy/CMakeFiles/opencv_legacy.dir/src/vecfacetracking.cpp.o [ 65%] Building CXX object modules/legacy/CMakeFiles/opencv_legacy.dir/src/video.cpp.o Linking CXX shared library ../../lib/libopencv_legacy.dylib [ 65%] Built target opencv_legacy Scanning dependencies of target opencv_haartraining_engine [ 65%] Scanning dependencies of target opencv_test_legacy [ 65%] Building NVCC (Device) object modules/gpu/CMakeFiles/cuda_compile.dir/src/nvidia/NPP_staging/./cuda_compile_generated_NPP_staging.cu.o Building NVCC (Device) object modules/gpu/CMakeFiles/cuda_compile.dir/src/cuda/./cuda_compile_generated_bf_knnmatch.cu.o [ 65%] Building CXX object modules/legacy/CMakeFiles/opencv_test_legacy.dir/test/test_bruteforcematcher.cpp.o [ 66%] Building CXX object apps/haartraining/CMakeFiles/opencv_haartraining_engine.dir/cvboost.cpp.o [ 66%] Building CXX object modules/legacy/CMakeFiles/opencv_test_legacy.dir/test/test_em.cpp.o /Users/michael/Documents/project/opencv/modules/core/include/opencv2/core/mat.hpp(366): warning: integer conversion resulted in a change of sign

/Users/michael/Documents/project/opencv/modules/core/include/opencv2/core/mat.hpp(2135): warning: integer conversion resulted in a change of sign

[ 66%] Building CXX object apps/haartraining/CMakeFiles/opencv_haartraining_engine.dir/cvcommon.cpp.o /Users/michael/Documents/project/opencv/modules/core/include/opencv2/core/mat.hpp(366): warning: integer conversion resulted in a change of sign

/Users/michael/Documents/project/opencv/modules/core/include/opencv2/core/mat.hpp(2135): warning: integer conversion resulted in a change of sign

/Users/michael/Documents/project/opencv/modules/core/include/opencv2/core/mat.hpp(366): warning: integer conversion resulted in a change of sign

/Users/michael/Documents/project/opencv/modules/core/include/opencv2/core/mat.hpp(2135): warning: integer conversion resulted in a change of sign

[ 66%] Building CXX object apps/haartraining/CMakeFiles/opencv_haartraining_engine.dir/cvhaarclassifier.cpp.o [ 66%] Building CXX object modules/legacy/CMakeFiles/opencv_test_legacy.dir/test/test_main.cpp.o /Users/michael/Documents/project/opencv/modules/core/include/opencv2/core/mat.hpp(366): warning: integer conversion resulted in a change of sign

/Users/michael/Documents/project/opencv/modules/core/include/opencv2/core/mat.hpp(2135): warning: integer conversion resulted in a change of sign

[ 66%] Building CXX object apps/haartraining/CMakeFiles/opencv_haartraining_engine.dir/cvhaartraining.cpp.o [ 67%] Building CXX object modules/legacy/CMakeFiles/opencv_test_legacy.dir/test/test_nearestneighbors.cpp.o /Users/michael/Documents/project/opencv/modules/core/include/opencv2/core/mat.hpp(366): warning: integer conversion resulted in a change of sign

/Users/michael/Documents/project/opencv/modules/core/include/opencv2/core/mat.hpp(2135): warning: integer conversion resulted in a change of sign

[ 67%] Building CXX object apps/haartraining/CMakeFiles/opencv_haartraining_engine.dir/cvsamples.cpp.o [ 67%] Building CXX object modules/legacy/CMakeFiles/opencv_test_legacy.dir/test/test_optflow.cpp.o /Users/michael/Documents/project/opencv/modules/core/include/opencv2/core/operations.hpp(2541): warning: integer conversion resulted in a change of sign

/Users/michael/Documents/project/opencv/modules/core/include/opencv2/core/mat.hpp(366): warning: integer conversion resulted in a change of sign

/Users/michael/Documents/project/opencv/modules/core/include/opencv2/core/mat.hpp(2135): warning: integer conversion resulted in a change of sign

Linking CXX static library ../../lib/libopencv_haartraining_engine.a [ 67%] Built target opencv_haartraining_engine [ 67%] Building NVCC (Device) object modules/gpu/CMakeFiles/cuda_compile.dir/src/cuda/./cuda_compile_generated_bf_match.cu.o [ 67%] Building CXX object modules/legacy/CMakeFiles/opencv_test_legacy.dir/test/test_precomp.cpp.o /Users/michael/Documents/project/opencv/modules/core/include/opencv2/core/operations.hpp(2541): warning: integer conversion resulted in a change of sign

/Users/michael/Documents/project/opencv/modules/core/include/opencv2/core/mat.hpp(366): warning: integer conversion resulted in a change of sign

/Users/michael/Documents/project/opencv/modules/core/include/opencv2/core/mat.hpp(2135): warning: integer conversion resulted in a change of sign

[ 67%] Building CXX object modules/legacy/CMakeFiles/opencv_test_legacy.dir/test/test_pyrsegmentation.cpp.o [ 67%] Building CXX object modules/legacy/CMakeFiles/opencv_test_legacy.dir/test/test_stereomatching.cpp.o /Users/michael/Documents/project/opencv/modules/core/include/opencv2/core/operations.hpp(2541): warning: integer conversion resulted in a change of sign

/Users/michael/Documents/project/opencv/modules/core/include/opencv2/core/mat.hpp(366): warning: integer conversion resulted in a change of sign

/Users/michael/Documents/project/opencv/modules/core/include/opencv2/core/mat.hpp(2135): warning: integer conversion resulted in a change of sign

[ 67%] Building CXX object modules/legacy/CMakeFiles/opencv_test_legacy.dir/test/test_subdivisions.cpp.o /Users/michael/Documents/project/opencv/modules/core/include/opencv2/core/operations.hpp(2541): warning: integer conversion resulted in a change of sign

/Users/michael/Documents/project/opencv/modules/core/include/opencv2/core/mat.hpp(366): warning: integer conversion resulted in a change of sign

/Users/michael/Documents/project/opencv/modules/core/include/opencv2/core/mat.hpp(2135): warning: integer conversion resulted in a change of sign

Linking CXX executable ../../bin/opencv_test_legacy [ 67%] Built target opencv_test_legacy Scanning dependencies of target opencv_createsamples [ 67%] Building CXX object apps/haartraining/CMakeFiles/opencv_createsamples.dir/createsamples.cpp.o Linking CXX executable ../../bin/opencv_createsamples [ 67%] Built target opencv_createsamples [ 67%] Building NVCC (Device) object modules/gpu/CMakeFiles/cuda_compile.dir/src/cuda/./cuda_compile_generated_bf_radius_match.cu.o /Users/michael/Documents/project/opencv/modules/core/include/opencv2/core/operations.hpp(2541): warning: integer conversion resulted in a change of sign

/Users/michael/Documents/project/opencv/modules/core/include/opencv2/core/mat.hpp(366): warning: integer conversion resulted in a change of sign

/Users/michael/Documents/project/opencv/modules/core/include/opencv2/core/mat.hpp(2135): warning: integer conversion resulted in a change of sign

/Users/michael/Documents/project/opencv/modules/gpu/src/nvidia/NPP_staging/NPP_staging.cu:425: warning: no previous prototype for ‘NCVStatus ncvSquaredIntegralImage_device(Ncv8u, Ncv32u, Ncv64u, Ncv32u, NcvSize32u, INCVMemAllocator&)’ [-Wmissing-prototypes] /Users/michael/Documents/project/opencv/modules/gpu/src/nvidia/NPP_staging/NPP_staging.cu:1380: warning: no previous prototype for ‘NCVStatus compactVector_32u_device(Ncv32u, Ncv32u, Ncv32u, Ncv32u, Ncv32u, INCVMemAllocator&)’ [-Wmissing-prototypes] /Users/michael/Documents/project/opencv/modules/gpu/src/nvidia/NPP_staging/NPP_staging.cu:1967: warning: no previous prototype for ‘NCVStatus BlendFrames(const Ncv32f, const Ncv32f, const Ncv32f, const Ncv32f, const Ncv32f, const Ncv32f, const Ncv32f, const Ncv32f, Ncv32u, Ncv32u, Ncv32u, Ncv32f, Ncv32f)’ [-Wmissing-prototypes] [ 67%] Building NVCC (Device) object modules/gpu/CMakeFiles/cuda_compile.dir/src/cuda/./cuda_compile_generated_bgfg_gmg.cu.o /Users/michael/Documents/project/opencv/modules/gpu/src/cuda/bgfg_gmg.cu:63: warning: no previous prototype for ‘void cv::gpu::device::bgfg_gmg::loadConstants(int, int, float, float, int, float, float, int, int)’ [-Wmissing-prototypes] /Users/michael/Documents/project/opencv/modules/gpu/src/cuda/bgfg_gmg.cu:76: warning: no previous prototype for ‘float cv::gpu::device::bgfg_gmg::findFeature(int, const cv::gpu::PtrStepi&, const cv::gpu::PtrStepf&, int, int, int)’ [-Wmissing-prototypes] /Users/michael/Documents/project/opencv/modules/gpu/src/cuda/bgfg_gmg.cu:88: warning: no previous prototype for ‘void cv::gpu::device::bgfg_gmg::normalizeHistogram(cv::gpu::PtrStepf, int, int, int)’ [-Wmissing-prototypes] /Users/michael/Documents/project/opencv/modules/gpu/src/cuda/bgfg_gmg.cu:101: warning: no previous prototype for ‘bool cv::gpu::device::bgfg_gmg::insertFeature(int, float, cv::gpu::PtrStepi, cv::gpu::PtrStepf, int, int, int&)’ [-Wmissing-prototypes] [ 67%] Building NVCC (Device) object modules/gpu/CMakeFiles/cuda_compile.dir/src/cuda/./cuda_compile_generated_bgfg_mog.cu.o /Users/michael/Documents/project/opencv/modules/gpu/src/cuda/bgfg_mog.cu:351: warning: no previous prototype for ‘void cv::gpu::device::mog::mog_gpu(cv::gpu::PtrStepSzb, int, cv::gpu::PtrStepSzb, cv::gpu::PtrStepSzf, cv::gpu::PtrStepSzf, cv::gpu::PtrStepSzb, cv::gpu::PtrStepSzb, int, float, float, float, float, CUstream_st)’ [-Wmissing-prototypes] /Users/michael/Documents/project/opencv/modules/gpu/src/cuda/bgfg_mog.cu:418: warning: no previous prototype for ‘void cv::gpu::device::mog::getBackgroundImage_gpu(int, cv::gpu::PtrStepSzf, cv::gpu::PtrStepSzb, cv::gpu::PtrStepSzb, int, float, CUstream_st)’ [-Wmissing-prototypes] /Users/michael/Documents/project/opencv/modules/gpu/src/cuda/bgfg_mog.cu:443: warning: no previous prototype for ‘void cv::gpu::device::mog::loadConstants(int, float, float, float, float, float, float, float, unsigned char)’ [-Wmissing-prototypes] /Users/michael/Documents/project/opencv/modules/gpu/src/cuda/bgfg_mog.cu:690: warning: no previous prototype for ‘void cv::gpu::device::mog::mog2_gpu(cv::gpu::PtrStepSzb, int, cv::gpu::PtrStepSzb, cv::gpu::PtrStepSzb, cv::gpu::PtrStepSzf, cv::gpu::PtrStepSzf, cv::gpu::PtrStepSzb, float, float, bool, CUstream_st)’ [-Wmissing-prototypes] /Users/michael/Documents/project/opencv/modules/gpu/src/cuda/bgfg_mog.cu:749: warning: no previous prototype for ‘void cv::gpu::device::mog::getBackgroundImage2_gpu(int, cv::gpu::PtrStepSzb, cv::gpu::PtrStepSzf, cv::gpu::PtrStepSzb, cv::gpu::PtrStepSzb, CUstream_st)’ [-Wmissing-prototypes] [ 67%] Building NVCC (Device) object modules/gpu/CMakeFiles/cuda_compile.dir/src/cuda/./cuda_compile_generated_bilateral_filter.cu.o [ 67%] Building NVCC (Device) object modules/gpu/CMakeFiles/cuda_compile.dir/src/cuda/./cuda_compile_generated_blend.cu.o /Users/michael/Documents/project/opencv/modules/gpu/src/cuda/blend.cu:106: warning: no previous prototype for ‘void cv::gpu::device::blend::blendLinearCaller8UC4(int, int, cv::gpu::PtrStepb, cv::gpu::PtrStepb, cv::gpu::PtrStepf, cv::gpu::PtrStepf, cv::gpu::PtrStepb, CUstream_st)’ [-Wmissing-prototypes] Scanning dependencies of target opencv_haartraining [ 67%] Building CXX object apps/haartraining/CMakeFiles/opencv_haartraining.dir/haartraining.cpp.o Linking CXX executable ../../bin/opencv_haartraining [ 67%] Built target opencv_haartraining Scanning dependencies of target opencv_performance [ 67%] Building CXX object apps/haartraining/CMakeFiles/opencv_performance.dir/performance.cpp.o Linking CXX executable ../../bin/opencv_performance [ 67%] Built target opencv_performance [ 67%] Building NVCC (Device) object modules/gpu/CMakeFiles/cuda_compile.dir/src/cuda/./cuda_compile_generated_calib3d.cu.o /Users/michael/Documents/project/opencv/modules/gpu/src/cuda/calib3d.cu:76: warning: no previous prototype for ‘void cv::gpu::device::transform_points::call(cv::gpu::PtrStepSz<float3>, const float, const float, cv::gpu::PtrStepSz<float3>, CUstream_st)’ [-Wmissing-prototypes] /Users/michael/Documents/project/opencv/modules/gpu/src/cuda/calib3d.cu:115: warning: no previous prototype for ‘void cv::gpu::device::project_points::call(cv::gpu::PtrStepSz<float3>, const float, const float, const float, cv::gpu::PtrStepSz<float2>, CUstream_st)’ [-Wmissing-prototypes] /Users/michael/Documents/project/opencv/modules/gpu/src/cuda/calib3d.cu:132: warning: no previous prototype for ‘int cv::gpu::device::solve_pnp_ransac::maxNumIters()’ [-Wmissing-prototypes] /Users/michael/Documents/project/opencv/modules/gpu/src/cuda/calib3d.cu:175: warning: no previous prototype for ‘void cv::gpu::device::solve_pnp_ransac::computeHypothesisScores(int, int, const float, const float3, const float3, const float2, float, int)’ [-Wmissing-prototypes] [ 67%] Building NVCC (Device) object modules/gpu/CMakeFiles/cuda_compile.dir/src/cuda/./cuda_compile_generated_canny.cu.o /Users/michael/Documents/project/opencv/modules/gpu/src/cuda/canny.cu:125: warning: no previous prototype for ‘void canny::calcMagnitude(cv::gpu::PtrStepSzb, int, int, cv::gpu::PtrStepSzi, cv::gpu::PtrStepSzi, cv::gpu::PtrStepSzf, bool)’ [-Wmissing-prototypes] /Users/michael/Documents/project/opencv/modules/gpu/src/cuda/canny.cu:149: warning: no previous prototype for ‘void canny::calcMagnitude(cv::gpu::PtrStepSzi, cv::gpu::PtrStepSzi, cv::gpu::PtrStepSzf, bool)’ [-Wmissing-prototypes] /Users/michael/Documents/project/opencv/modules/gpu/src/cuda/canny.cu:222: warning: no previous prototype for ‘void canny::calcMap(cv::gpu::PtrStepSzi, cv::gpu::PtrStepSzi, cv::gpu::PtrStepSzf, cv::gpu::PtrStepSzi, float, float)’ [-Wmissing-prototypes] /Users/michael/Documents/project/opencv/modules/gpu/src/cuda/canny.cu:324: warning: no previous prototype for ‘void canny::edgesHysteresisLocal(cv::gpu::PtrStepSzi, ushort2)’ [-Wmissing-prototypes] /Users/michael/Documents/project/opencv/modules/gpu/src/cuda/canny.cu:435: warning: no previous prototype for ‘void canny::edgesHysteresisGlobal(cv::gpu::PtrStepSzi, ushort2, ushort2)’ [-Wmissing-prototypes] /Users/michael/Documents/project/opencv/modules/gpu/src/cuda/canny.cu:488: warning: no previous prototype for ‘void canny::getEdges(cv::gpu::PtrStepSzi, cv::gpu::PtrStepSzb)’ [-Wmissing-prototypes] Scanning dependencies of target opencv_traincascade [ 67%] Building CXX object apps/traincascade/CMakeFiles/opencv_traincascade.dir/traincascade.cpp.o [ 67%] Building CXX object apps/traincascade/CMakeFiles/opencv_traincascade.dir/cascadeclassifier.cpp.o [ 67%] Building CXX object apps/traincascade/CMakeFiles/opencv_traincascade.dir/boost.cpp.o [ 68%] Building CXX object apps/traincascade/CMakeFiles/opencv_traincascade.dir/features.cpp.o [ 68%] Building CXX object apps/traincascade/CMakeFiles/opencv_traincascade.dir/haarfeatures.cpp.o [ 68%] Building CXX object apps/traincascade/CMakeFiles/opencv_traincascade.dir/lbpfeatures.cpp.o [ 69%] Building NVCC (Device) object modules/gpu/CMakeFiles/cuda_compile.dir/src/cuda/./cuda_compile_generated_ccomponetns.cu.o [ 69%] Building CXX object apps/traincascade/CMakeFiles/opencv_traincascade.dir/HOGfeatures.cpp.o [ 69%] Building CXX object apps/traincascade/CMakeFiles/opencv_traincascade.dir/imagestorage.cpp.o Linking CXX executable ../../bin/opencv_traincascade [ 69%] Built target opencv_traincascade [ 69%] Building NVCC (Device) object modules/gpu/CMakeFiles/cuda_compile.dir/src/cuda/./cuda_compile_generated_clahe.cu.o /Users/michael/Documents/project/opencv/modules/gpu/src/cuda/ccomponetns.cu(321): Advisory: Loop was not unrolled, unexpected call OPs /Users/michael/Documents/project/opencv/modules/gpu/src/cuda/ccomponetns.cu(319): Advisory: Loop was not unrolled, not an innermost loop /Users/michael/Documents/project/opencv/modules/gpu/src/cuda/clahe.cu:124: warning: no previous prototype for ‘void clahe::calcLut(cv::gpu::PtrStepSzb, cv::gpu::PtrStepb, int, int, int2, int, float, CUstream_st)’ [-Wmissing-prototypes] /Users/michael/Documents/project/opencv/modules/gpu/src/cuda/clahe.cu:171: warning: no previous prototype for ‘void clahe::transform(cv::gpu::PtrStepSzb, cv::gpu::PtrStepSzb, cv::gpu::PtrStepb, int, int, int2, CUstream_st)’ [-Wmissing-prototypes] [ 69%] Building NVCC (Device) object modules/gpu/CMakeFiles/cuda_compile.dir/src/cuda/./cuda_compile_generated_color.cu.o /Users/michael/Documents/project/opencv/modules/gpu/src/cuda/ccomponetns.cu(321): Advisory: Loop was not unrolled, unexpected call OPs /Users/michael/Documents/project/opencv/modules/gpu/src/cuda/ccomponetns.cu(319): Advisory: Loop was not unrolled, not an innermost loop /Users/michael/Documents/project/opencv/modules/gpu/src/cuda/ccomponetns.cu:499: warning: no previous prototype for ‘void cv::gpu::device::ccl::labelComponents(const cv::gpu::PtrStepSzb&, cv::gpu::PtrStepSzi, int, CUstream_st)’ [-Wmissing-prototypes] [ 69%] Building NVCC (Device) object modules/gpu/CMakeFiles/cuda_compile.dir/src/cuda/./cuda_compile_generated_column_filter.0.cu.o [ 69%] Building NVCC (Device) object modules/gpu/CMakeFiles/cuda_compile.dir/src/cuda/./cuda_compile_generated_column_filter.1.cu.o /Users/michael/Documents/project/opencv/modules/gpu/src/cuda/bf_knnmatch.cu:1125: warning: no previous prototype for ‘void cv::gpu::device::bf_knnmatch::findKnnMatchDispatcher(int, const cv::gpu::PtrStepSzb&, const cv::gpu::PtrStepSzb&, const cv::gpu::PtrStepSzf&, CUstream_st)’ [-Wmissing-prototypes] [ 69%] Building NVCC (Device) object modules/gpu/CMakeFiles/cuda_compile.dir/src/cuda/./cuda_compile_generated_column_filter.10.cu.o [ 69%] Building NVCC (Device) object modules/gpu/CMakeFiles/cuda_compile.dir/src/cuda/./cuda_compile_generated_column_filter.11.cu.o [ 69%] Building NVCC (Device) object modules/gpu/CMakeFiles/cuda_compile.dir/src/cuda/./cuda_compile_generated_column_filter.12.cu.o [ 69%] Building NVCC (Device) object modules/gpu/CMakeFiles/cuda_compile.dir/src/cuda/./cuda_compile_generated_column_filter.13.cu.o [ 69%] Building NVCC (Device) object modules/gpu/CMakeFiles/cuda_compile.dir/src/cuda/./cuda_compile_generated_column_filter.14.cu.o [ 69%] Building NVCC (Device) object modules/gpu/CMakeFiles/cuda_compile.dir/src/cuda/./cuda_compile_generated_column_filter.2.cu.o [ 69%] Building NVCC (Device) object modules/gpu/CMakeFiles/cuda_compile.dir/src/cuda/./cuda_compile_generated_column_filter.3.cu.o [ 69%] Building NVCC (Device) object modules/gpu/CMakeFiles/cuda_compile.dir/src/cuda/./cuda_compile_generated_column_filter.4.cu.o [ 69%] Building NVCC (Device) object modules/gpu/CMakeFiles/cuda_compile.dir/src/cuda/./cuda_compile_generated_column_filter.5.cu.o [ 70%] Building NVCC (Device) object modules/gpu/CMakeFiles/cuda_compile.dir/src/cuda/./cuda_compile_generated_column_filter.6.cu.o [ 70%] Building NVCC (Device) object modules/gpu/CMakeFiles/cuda_compile.dir/src/cuda/./cuda_compile_generated_column_filter.7.cu.o [ 70%] Building NVCC (Device) object modules/gpu/CMakeFiles/cuda_compile.dir/src/cuda/./cuda_compile_generated_column_filter.8.cu.o [ 70%] Building NVCC (Device) object modules/gpu/CMakeFiles/cuda_compile.dir/src/cuda/./cuda_compile_generated_column_filter.9.cu.o [ 70%] Building NVCC (Device) object modules/gpu/CMakeFiles/cuda_compile.dir/src/cuda/./cuda_compile_generated_copy_make_border.cu.o [ 70%] Building NVCC (Device) object modules/gpu/CMakeFiles/cuda_compile.dir/src/cuda/./cuda_compile_generated_debayer.cu.o [ 70%] Building NVCC (Device) object modules/gpu/CMakeFiles/cuda_compile.dir/src/cuda/./cuda_compile_generated_disp_bilateral_filter.cu.o /Users/michael/Documents/project/opencv/modules/gpu/src/cuda/disp_bilateral_filter.cu:62: warning: no previous prototype for ‘void cv::gpu::device::disp_bilateral_filter::disp_load_constants(float, cv::gpu::PtrStepSzf, int, int, short int, short int)’ [-Wmissing-prototypes] [ 70%] Building NVCC (Device) object modules/gpu/CMakeFiles/cuda_compile.dir/src/cuda/./cuda_compile_generated_element_operations.cu.o [ 70%] Building NVCC (Device) object modules/gpu/CMakeFiles/cuda_compile.dir/src/cuda/./cuda_compile_generated_fast.cu.o /Users/michael/Documents/project/opencv/modules/gpu/src/cuda/fast.cu:69: warning: no previous prototype for ‘void cv::gpu::device::fast::calcMask(const cv::gpu::device::uint, int, int, int&, int&)’ [-Wmissing-prototypes] /Users/michael/Documents/project/opencv/modules/gpu/src/cuda/fast.cu:195: warning: no previous prototype for ‘int cv::gpu::device::fast::cornerScore(const cv::gpu::device::uint, int, int)’ [-Wmissing-prototypes] /Users/michael/Documents/project/opencv/modules/gpu/src/cuda/fast.cu:282: warning: no previous prototype for ‘int cv::gpu::device::fast::calcKeypoints_gpu(cv::gpu::PtrStepSzb, cv::gpu::PtrStepSzb, short2, int, cv::gpu::PtrStepSzi, int)’ [-Wmissing-prototypes] /Users/michael/Documents/project/opencv/modules/gpu/src/cuda/fast.cu:359: warning: no previous prototype for ‘int cv::gpu::device::fast::nonmaxSupression_gpu(const short2, int, cv::gpu::PtrStepSzi, short2, float)’ [-Wmissing-prototypes] [ 70%] Building NVCC (Device) object modules/gpu/CMakeFiles/cuda_compile.dir/src/cuda/./cuda_compile_generated_fgd_bgfg.cu.o [ 70%] Building NVCC (Device) object modules/gpu/CMakeFiles/cuda_compile.dir/src/cuda/./cuda_compile_generated_gftt.cu.o ptxas /tmp/tmpxft_00004b99_00000000-17_element_operations.compute_11.ptx, line 3345; warning : Double is not supported. Demoting to float /Users/michael/Documents/project/opencv/modules/gpu/src/cuda/gftt.cu:98: warning: no previous prototype for ‘int cv::gpu::device::gfft::findCorners_gpu(cv::gpu::PtrStepSzf, float, cv::gpu::PtrStepSzb, float2, int)’ [-Wmissing-prototypes] /Users/michael/Documents/project/opencv/modules/gpu/src/cuda/gftt.cu:135: warning: no previous prototype for ‘void cv::gpu::device::gfft::sortCorners_gpu(cv::gpu::PtrStepSzf, float2, int)’ [-Wmissing-prototypes] [ 70%] Building NVCC (Device) object modules/gpu/CMakeFiles/cuda_compile.dir/src/cuda/./cuda_compile_generated_global_motion.cu.o [ 70%] Building NVCC (Device) object modules/gpu/CMakeFiles/cuda_compile.dir/src/cuda/./cuda_compile_generated_hist.cu.o /Users/michael/Documents/project/opencv/modules/gpu/src/cuda/global_motion.cu:55: warning: no previous prototype for ‘int cv::gpu::device::globmotion::compactPoints(int, float, float, const cv::gpu::device::uchar)’ [-Wmissing-prototypes] /Users/michael/Documents/project/opencv/modules/gpu/src/cuda/global_motion.cu:99: warning: no previous prototype for ‘void cv::gpu::device::globmotion::calcWobbleSuppressionMaps(int, int, int, int, int, const float, const float, cv::gpu::PtrStepSzf, cv::gpu::PtrStepSzf)’ [-Wmissing-prototypes] [ 71%] Building NVCC (Device) object modules/gpu/CMakeFiles/cuda_compile.dir/src/cuda/./cuda_compile_generated_hog.cu.o /Users/michael/Documents/project/opencv/modules/gpu/src/cuda/hist.cu:97: warning: no previous prototype for ‘void hist::histogram256(cv::gpu::PtrStepSzb, int, CUstream_st)’ [-Wmissing-prototypes] /Users/michael/Documents/project/opencv/modules/gpu/src/cuda/hist.cu:140: warning: no previous prototype for ‘void hist::equalizeHist(cv::gpu::PtrStepSzb, cv::gpu::PtrStepSzb, const int, CUstream_st)’ [-Wmissing-prototypes] [ 71%] Building NVCC (Device) object modules/gpu/CMakeFiles/cuda_compile.dir/src/cuda/./cuda_compile_generated_hough.cu.o /Users/michael/Documents/project/opencv/modules/gpu/src/cuda/hog.cu:73: warning: no previous prototype for ‘int cv::gpu::device::hog::power_2up(unsigned int)’ [-Wmissing-prototypes] /Users/michael/Documents/project/opencv/modules/gpu/src/cuda/hog.cu:91: warning: no previous prototype for ‘void cv::gpu::device::hog::set_up_constants(int, int, int, int, int)’ [-Wmissing-prototypes] /Users/michael/Documents/project/opencv/modules/gpu/src/cuda/hog.cu:197: warning: no previous prototype for ‘void cv::gpu::device::hog::compute_hists(int, int, int, int, int, const cv::gpu::PtrStepSzf&, const cv::gpu::PtrStepSzb&, float, float)’ [-Wmissing-prototypes] /Users/michael/Documents/project/opencv/modules/gpu/src/cuda/hog.cu:296: warning: no previous prototype for ‘void cv::gpu::device::hog::normalize_hists(int, int, int, int, int, float, float)’ [-Wmissing-prototypes] /Users/michael/Documents/project/opencv/modules/gpu/src/cuda/hog.cu:368: warning: no previous prototype for ‘void cv::gpu::device::hog::compute_confidence_hists(int, int, int, int, int, int, int, int, float, float, float, float, float)’ [-Wmissing-prototypes] /Users/michael/Documents/project/opencv/modules/gpu/src/cuda/hog.cu:430: warning: no previous prototype for ‘void cv::gpu::device::hog::classify_hists(int, int, int, int, int, int, int, int, float, float, float, float, unsigned char)’ [-Wmissing-prototypes] /Users/michael/Documents/project/opencv/modules/gpu/src/cuda/hog.cu:480: warning: no previous prototype for ‘void cv::gpu::device::hog::extract_descrs_by_rows(int, int, int, int, int, int, int, int, float, cv::gpu::PtrStepSzf)’ [-Wmissing-prototypes] /Users/michael/Documents/project/opencv/modules/gpu/src/cuda/hog.cu:529: warning: no previous prototype for ‘void cv::gpu::device::hog::extract_descrs_by_cols(int, int, int, int, int, int, int, int, float, cv::gpu::PtrStepSzf)’ [-Wmissing-prototypes] /Users/michael/Documents/project/opencv/modules/gpu/src/cuda/hog.cu:656: warning: no previous prototype for ‘void cv::gpu::device::hog::compute_gradients_8UC4(int, int, int, const cv::gpu::PtrStepSzb&, float, cv::gpu::PtrStepSzf, cv::gpu::PtrStepSzb, bool)’ [-Wmissing-prototypes] /Users/michael/Documents/project/opencv/modules/gpu/src/cuda/hog.cu:729: warning: no previous prototype for ‘void cv::gpu::device::hog::compute_gradients_8UC1(int, int, int, const cv::gpu::PtrStepSzb&, float, cv::gpu::PtrStepSzf, cv::gpu::PtrStepSzb, bool)’ [-Wmissing-prototypes] /Users/michael/Documents/project/opencv/modules/gpu/src/cuda/hog.cu:808: warning: no previous prototype for ‘void cv::gpu::device::hog::resize_8UC1(const cv::gpu::PtrStepSzb&, cv::gpu::PtrStepSzb)’ [-Wmissing-prototypes] /Users/michael/Documents/project/opencv/modules/gpu/src/cuda/hog.cu:809: warning: no previous prototype for ‘void cv::gpu::device::hog::resize_8UC4(const cv::gpu::PtrStepSzb&, cv::gpu::PtrStepSzb)’ [-Wmissing-prototypes] [ 71%] Building NVCC (Device) object modules/gpu/CMakeFiles/cuda_compile.dir/src/cuda/./cuda_compile_generated_imgproc.cu.o /Users/michael/Documents/project/opencv/modules/core/include/opencv2/core/mat.hpp(366): warning: integer conversion resulted in a change of sign

/Users/michael/Documents/project/opencv/modules/core/include/opencv2/core/mat.hpp(2135): warning: integer conversion resulted in a change of sign

/Users/michael/Documents/project/opencv/modules/core/include/opencv2/core/mat.hpp(366): warning: integer conversion resulted in a change of sign

/Users/michael/Documents/project/opencv/modules/core/include/opencv2/core/mat.hpp(2135): warning: integer conversion resulted in a change of sign

[ 71%] Building NVCC (Device) object modules/gpu/CMakeFiles/cuda_compile.dir/src/cuda/./cuda_compile_generated_integral_image.cu.o /Users/michael/Documents/project/opencv/modules/core/include/opencv2/core/mat.hpp(366): warning: integer conversion resulted in a change of sign

/Users/michael/Documents/project/opencv/modules/core/include/opencv2/core/mat.hpp(2135): warning: integer conversion resulted in a change of sign

/Users/michael/Documents/project/opencv/modules/core/include/opencv2/core/mat.hpp(366): warning: integer conversion resulted in a change of sign

/Users/michael/Documents/project/opencv/modules/core/include/opencv2/core/mat.hpp(2135): warning: integer conversion resulted in a change of sign

ptxas /tmp/tmpxft_00004b99_00000000-14_element_operations.compute_12.ptx, line 3345; warning : Double is not supported. Demoting to float /Users/michael/Documents/project/opencv/modules/core/include/opencv2/core/mat.hpp(366): warning: integer conversion resulted in a change of sign

/Users/michael/Documents/project/opencv/modules/core/include/opencv2/core/mat.hpp(2135): warning: integer conversion resulted in a change of sign

/Users/michael/Documents/project/opencv/modules/core/include/opencv2/core/operations.hpp(2541): warning: integer conversion resulted in a change of sign

/Users/michael/Documents/project/opencv/modules/core/include/opencv2/core/mat.hpp(366): warning: integer conversion resulted in a change of sign

/Users/michael/Documents/project/opencv/modules/gpu/src/cuda/integral_image.cu:52: warning: no previous prototype for ‘uchar4 cv::gpu::device::imgproc::int_to_uchar4(unsigned int)’ [-Wmissing-prototypes] /Users/michael/Documents/project/opencv/modules/gpu/src/cuda/integral_image.cu:360: warning: no previous prototype for ‘void cv::gpu::device::imgproc::shfl_integral_gpu(const cv::gpu::PtrStepSzb&, cv::gpu::PtrStepSz<unsigned int="">, CUstream_st)’ [-Wmissing-prototypes] /Users/michael/Documents/project/opencv/modules/gpu/src/cuda/integral_image.cu:449: warning: no previous prototype for ‘void cv::gpu::device::imgproc::shfl_integral_gpu_buffered(cv::gpu::PtrStepSzb, cv::gpu::PtrStepSz<uint4>, cv::gpu::PtrStepSz<unsigned int="">, int, CUstream_st)’ [-Wmissing-prototypes] /Users/michael/Documents/project/opencv/modules/core/include/opencv2/core/mat.hpp(2135): warning: integer conversion resulted in a change of sign

[ 71%] Building NVCC (Device) object modules/gpu/CMakeFiles/cuda_compile.dir/src/cuda/./cuda_compile_generated_lbp.cu.o /Users/michael/Documents/project/opencv/modules/core/include/opencv2/core/operations.hpp(2541): warning: integer conversion resulted in a change of sign

/Users/michael/Documents/project/opencv/modules/core/include/opencv2/core/mat.hpp(366): warning: integer conversion resulted in a change of sign

/Users/michael/Documents/project/opencv/modules/core/include/opencv2/core/mat.hpp(2135): warning: integer conversion resulted in a change of sign

/Users/michael/Documents/project/opencv/modules/gpu/src/cuda/lbp.cu:186: warning: no previous prototype for ‘void cv::gpu::device::lbp::connectedConmonents(cv::gpu::PtrStepSz<int4>, int, cv::gpu::PtrStepSz<int4>, int, float, unsigned int)’ [-Wmissing-prototypes] /Users/michael/Documents/project/opencv/modules/gpu/src/cuda/lbp.cu:292: warning: no previous prototype for ‘void cv::gpu::device::lbp::classifyPyramid(int, int, int, int, float, float, int, const cv::gpu::PtrStepSzb&, int, const cv::gpu::PtrStepSzi&, const cv::gpu::PtrStepSzf&, const cv::gpu::PtrStepSzi&, const cv::gpu::PtrStepSzb&, int, cv::gpu::PtrStepSz<int4>, unsigned int, cv::gpu::PtrStepSzi)’ [-Wmissing-prototypes] [ 71%] Building NVCC (Device) object modules/gpu/CMakeFiles/cuda_compile.dir/src/cuda/./cuda_compile_generated_match_template.cu.o /Users/michael/Documents/project/opencv/modules/core/include/opencv2/core/operations.hpp(2541): warning: integer conversion resulted in a change of sign

/Users/michael/Documents/project/opencv/modules/core/include/opencv2/core/mat.hpp(366): warning: integer conversion resulted in a change of sign

/Users/michael/Documents/project/opencv/modules/core/include/opencv2/core/mat.hpp(2135): warning: integer conversion resulted in a change of sign

/Users/michael/Documents/project/opencv/modules/core/include/opencv2/core/operations.hpp(2541): warning: integer conversion resulted in a change of sign

/Users/michael/Documents/project/opencv/modules/core/include/opencv2/core/mat.hpp(366): warning: integer conversion resulted in a change of sign

/Users/michael/Documents/project/opencv/modules/core/include/opencv2/core/mat.hpp(2135): warning: integer conversion resulted in a change of sign

/Users/michael/Documents/project/opencv/modules/core/include/opencv2/core/operations.hpp(2541): warning: integer conversion resulted in a change of sign

/Users/michael/Documents/project/opencv/modules/core/include/opencv2/core/mat.hpp(366): warning: integer conversion resulted in a change of sign

/Users/michael/Documents/project/opencv/modules/core/include/opencv2/core/mat.hpp(2135): warning: integer conversion resulted in a change of sign

/Users/michael/Documents/project/opencv/modules/gpu/src/cuda/imgproc.cu:62: warning: no previous prototype for ‘short2 cv::gpu::device::imgproc::do_mean_shift(int, int, unsigned char, size_t, int, int, int, int, int, float)’ [-Wmissing-prototypes] /Users/michael/Documents/project/opencv/modules/gpu/src/cuda/imgproc.cu:149: warning: no previous prototype for ‘void cv::gpu::device::imgproc::meanShiftFiltering_gpu(const cv::gpu::PtrStepSzb&, cv::gpu::PtrStepSzb, int, int, int, float, CUstream_st)’ [-Wmissing-prototypes] /Users/michael/Documents/project/opencv/modules/gpu/src/cuda/imgproc.cu:168: warning: no previous prototype for ‘void cv::gpu::device::imgproc::meanShiftProc_gpu(const cv::gpu::PtrStepSzb&, cv::gpu::PtrStepSzb, cv::gpu::PtrStepSzb, int, int, int, float, CUstream_st)’ [-Wmissing-prototypes] /Users/michael/Documents/project/opencv/modules/gpu/src/cuda/imgproc.cu:290: warning: no previous prototype for ‘void cv::gpu::device::imgproc::drawColorDisp_gpu(const cv::gpu::PtrStepSzb&, const cv::gpu::PtrStepSzb&, int, CUstream_st const&)’ [-Wmissing-prototypes] /Users/michael/Documents/project/opencv/modules/gpu/src/cuda/imgproc.cu:304: warning: no previous prototype for ‘void cv::gpu::device::imgproc::drawColorDisp_gpu(const cv::gpu::PtrStepSz<short int="">&, const cv::gpu::PtrStepSzb&, int, CUstream_st* const&)’ [-Wmissing-prototypes] /Users/michael/Documents/project/opencv/modules/gpu/src/cuda/imgproc.cu:444: warning: no previous prototype for ‘void cv::gpu::device::imgproc::cornerHarris_gpu(int, float, cv::gpu::PtrStepSzf, cv::gpu::PtrStepSzf, cv::gpu::PtrStepSzf, int, CUstream_st)’ [-Wmissing-prototypes] /Users/michael/Documents/project/opencv/modules/gpu/src/cuda/imgproc.cu:556: warning: no previous prototype for ‘void cv::gpu::device::imgproc::cornerMinEigenVal_gpu(int, cv::gpu::PtrStepSzf, cv::gpu::PtrStepSzf, cv::gpu::PtrStepSzf, int, CUstream_st)’ [-Wmissing-prototypes] /Users/michael/Documents/project/opencv/modules/gpu/src/cuda/imgproc.cu:608: warning: no previous prototype for ‘void cv::gpu::device::imgproc::columnSum_32F(cv::gpu::PtrStepSzb, cv::gpu::PtrStepSzb)’ [-Wmissing-prototypes] /Users/michael/Documents/project/opencv/modules/gpu/src/cuda/imgproc.cu:635: warning: no previous prototype for ‘void cv::gpu::device::imgproc::mulSpectrums(cv::gpu::PtrStep<float2>, cv::gpu::PtrStep<float2>, cv::gpu::PtrStepSz<float2>, CUstream_st)’ [-Wmissing-prototypes] /Users/michael/Documents/project/opencv/modules/gpu/src/cuda/imgproc.cu:663: warning: no previous prototype for ‘void cv::gpu::device::imgproc::mulSpectrums_CONJ(cv::gpu::PtrStep<float2>, cv::gpu::PtrStep<float2>, cv::gpu::PtrStepSz<float2>, CUstream_st)’ [-Wmissing-prototypes] /Users/michael/Documents/project/opencv/modules/gpu/src/cuda/imgproc.cu:692: warning: no previous prototype for ‘void cv::gpu::device::imgproc::mulAndScaleSpectrums(cv::gpu::PtrStep<float2>, cv::gpu::PtrStep<float2>, float, cv::gpu::PtrStepSz<float2>, CUstream_st)’ [-Wmissing-prototypes] /Users/michael/Documents/project/opencv/modules/gpu/src/cuda/imgproc.cu:721: warning: no previous prototype for ‘void cv::gpu::device::imgproc::mulAndScaleSpectrums_CONJ(cv::gpu::PtrStep<float2>, cv::gpu::PtrStep<float2>, float, cv::gpu::PtrStepSz<float2>, CUstream_st)’ [-Wmissing-prototypes] /Users/michael/Documents/project/opencv/modules/gpu/src/cuda/imgproc.cu:838: warning: no previous prototype for ‘void cv::gpu::device::imgproc::buildWarpPlaneMaps(int, int, cv::gpu::PtrStepSzf, cv::gpu::PtrStepSzf, const float, const float, const float, float, CUstream_st)’ [-Wmissing-prototypes] /Users/michael/Documents/project/opencv/modules/gpu/src/cuda/imgproc.cu:860: warning: no previous prototype for ‘void cv::gpu::device::imgproc::buildWarpCylindricalMaps(int, int, cv::gpu::PtrStepSzf, cv::gpu::PtrStepSzf, const float, const float, float, CUstream_st)’ [-Wmissing-prototypes] /Users/michael/Documents/project/opencv/modules/gpu/src/cuda/imgproc.cu:881: warning: no previous prototype for ‘void cv::gpu::device::imgproc::buildWarpSphericalMaps(int, int, cv::gpu::PtrStepSzf, cv::gpu::PtrStepSzf, const float, const float, float, CUstream_st)’ [-Wmissing-prototypes] [ 71%] Building NVCC (Device) object modules/gpu/CMakeFiles/cuda_compile.dir/src/cuda/./cuda_compile_generated_mathfunc.cu.o /Users/michael/Documents/project/opencv/modules/gpu/src/cuda/match_template.cu:123: warning: no previous prototype for ‘void cv::gpu::device::match_template::matchTemplateNaive_CCORR_32F(cv::gpu::PtrStepSzb, cv::gpu::PtrStepSzb, cv::gpu::PtrStepSzf, int, CUstream_st)’ [-Wmissing-prototypes] /Users/michael/Documents/project/opencv/modules/gpu/src/cuda/match_template.cu:136: warning: no previous prototype for ‘void cv::gpu::device::match_template::matchTemplateNaive_CCORR_8U(cv::gpu::PtrStepSzb, cv::gpu::PtrStepSzb, cv::gpu::PtrStepSzf, int, CUstream_st)’ [-Wmissing-prototypes] /Users/michael/Documents/project/opencv/modules/gpu/src/cuda/match_template.cu:193: warning: no previous prototype for ‘void cv::gpu::device::match_template::matchTemplateNaive_SQDIFF_32F(cv::gpu::PtrStepSzb, cv::gpu::PtrStepSzb, cv::gpu::PtrStepSzf, int, CUstream_st)’ [-Wmissing-prototypes] /Users/michael/Documents/project/opencv/modules/gpu/src/cuda/match_template.cu:205: warning: no previous prototype for ‘void cv::gpu::device::match_template::matchTemplateNaive_SQDIFF_8U(cv::gpu::PtrStepSzb, cv::gpu::PtrStepSzb, cv::gpu::PtrStepSzf, int, CUstream_st)’ [-Wmissing-prototypes] /Users/michael/Documents/project/opencv/modules/gpu/src/cuda/match_template.cu:250: warning: no previous prototype for ‘void cv::gpu::device::match_template::matchTemplatePrepared_SQDIFF_8U(int, int, cv::gpu::PtrStepSz<long long="" unsigned="" int="">, long long unsigned int, cv::gpu::PtrStepSzf, int, CUstream_st)’ [-Wmissing-prototypes] /Users/michael/Documents/project/opencv/modules/gpu/src/cuda/match_template.cu:268: warning: no previous prototype for ‘float cv::gpu::device::match_template::normAcc(float, float)’ [-Wmissing-prototypes] /Users/michael/Documents/project/opencv/modules/gpu/src/cuda/match_template.cu:278: warning: no previous prototype for ‘float cv::gpu::device::match_template::normAcc_SQDIFF(float, float)’ [-Wmissing-prototypes] /Users/michael/Documents/project/opencv/modules/gpu/src/cuda/match_template.cu:323: warning: no previous prototype for ‘void cv::gpu::device::match_template::matchTemplatePrepared_SQDIFF_NORMED_8U(int, int, cv::gpu::PtrStepSz<long long="" unsigned="" int="">, long long unsigned int, cv::gpu::PtrStepSzf, int, CUstream_st)’ [-Wmissing-prototypes] /Users/michael/Documents/project/opencv/modules/gpu/src/cuda/match_template.cu:352: warning: no previous prototype for ‘void cv::gpu::device::match_template::matchTemplatePrepared_CCOFF_8U(int, int, cv::gpu::PtrStepSz<unsigned int="">, unsigned int, cv::gpu::PtrStepSzf, CUstream_st)’ [-Wmissing-prototypes] /Users/michael/Documents/project/opencv/modules/gpu/src/cuda/match_template.cu:394: warning: no previous prototype for ‘void cv::gpu::device::match_template::matchTemplatePrepared_CCOFF_8UC2(int, int, cv::gpu::PtrStepSz<unsigned int="">, cv::gpu::PtrStepSz<unsigned int="">, unsigned int, unsigned int, cv::gpu::PtrStepSzf, CUstream_st)’ [-Wmissing-prototypes] /Users/michael/Documents/project/opencv/modules/gpu/src/cuda/match_template.cu:449: warning: no previous prototype for ‘void cv::gpu::device::match_template::matchTemplatePrepared_CCOFF_8UC3(int, int, cv::gpu::PtrStepSz<unsigned int="">, cv::gpu::PtrStepSz<unsigned int="">, cv::gpu::PtrStepSz<unsigned int="">, unsigned int, unsigned int, unsigned int, cv::gpu::PtrStepSzf, CUstream_st)’ [-Wmissing-prototypes] /Users/michael/Documents/project/opencv/modules/gpu/src/cuda/match_template.cu:515: warning: no previous prototype for ‘void cv::gpu::device::match_template::matchTemplatePrepared_CCOFF_8UC4(int, int, cv::gpu::PtrStepSz<unsigned int="">, cv::gpu::PtrStepSz<unsigned int="">, cv::gpu::PtrStepSz<unsigned int="">, cv::gpu::PtrStepSz<unsigned int="">, unsigned int, unsigned int, unsigned int, unsigned int, cv::gpu::PtrStepSzf, CUstream_st)’ [-Wmissing-prototypes] /Users/michael/Documents/project/opencv/modules/gpu/src/cuda/match_template.cu:565: warning: no previous prototype for ‘void cv::gpu::device::match_template::matchTemplatePrepared_CCOFF_NORMED_8U(int, int, cv::gpu::PtrStepSz<unsigned int="">, cv::gpu::PtrStepSz<long long="" unsigned="" int="">, unsigned int, long long unsigned int, cv::gpu::PtrStepSzf, CUstream_st)’ [-Wmissing-prototypes] /Users/michael/Documents/project/opencv/modules/gpu/src/cuda/match_template.cu:625: warning: no previous prototype for ‘void cv::gpu::device::match_template::matchTemplatePrepared_CCOFF_NORMED_8UC2(int, int, cv::gpu::PtrStepSz<unsigned int="">, cv::gpu::PtrStepSz<long long="" unsigned="" int="">, cv::gpu::PtrStepSz<unsigned int="">, cv::gpu::PtrStepSz<long long="" unsigned="" int="">, unsigned int, long long unsigned int, unsigned int, long long unsigned int, cv::gpu::PtrStepSzf, CUstream_st)’ [-Wmissing-prototypes] /Users/michael/Documents/project/opencv/modules/gpu/src/cuda/match_template.cu:702: warning: no previous prototype for ‘void cv::gpu::device::match_template::matchTemplatePrepared_CCOFF_NORMED_8UC3(int, int, cv::gpu::PtrStepSz<unsigned int="">, cv::gpu::PtrStepSz<long long="" unsigned="" int="">, cv::gpu::PtrStepSz<unsigned int="">, cv::gpu::PtrStepSz<long long="" unsigned="" int="">, cv::gpu::PtrStepSz<unsigned int="">, cv::gpu::PtrStepSz<long long="" unsigned="" int="">, unsigned int, long long unsigned int, unsigned int, long long unsigned int, unsigned int, long long unsigned int, cv::gpu::PtrStepSzf, CUstream_st)’ [-Wmissing-prototypes] /Users/michael/Documents/project/opencv/modules/gpu/src/cuda/match_template.cu:791: warning: no previous prototype for ‘void cv::gpu::device::match_template::matchTemplatePrepared_CCOFF_NORMED_8UC4(int, int, cv::gpu::PtrStepSz<unsigned int="">, cv::gpu::PtrStepSz<long long="" unsigned="" int="">, cv::gpu::PtrStepSz<unsigned int="">, cv::gpu::PtrStepSz<long long="" unsigned="" int="">, cv::gpu::PtrStepSz<unsigned int="">, cv::gpu::PtrStepSz<long long="" unsigned="" int="">, cv::gpu::PtrStepSz<unsigned int="">, cv::gpu::PtrStepSz<long long="" unsigned="" int="">, unsigned int, long long unsigned int, unsigned int, long long unsigned int, unsigned int, long long unsigned int, unsigned int, long long unsigned int, cv::gpu::PtrStepSzf, CUstream_st)’ [-Wmissing-prototypes] /Users/michael/Documents/project/opencv/modules/gpu/src/cuda/match_template.cu:842: warning: no previous prototype for ‘void cv::gpu::device::match_template::normalize_8U(int, int, cv::gpu::PtrStepSz<long long="" unsigned="" int="">, long long unsigned int, cv::gpu::PtrStepSzf, int, CUstream_st)’ [-Wmissing-prototypes] /Users/michael/Documents/project/opencv/modules/gpu/src/cuda/match_template.cu:887: warning: no previous prototype for ‘void cv::gpu::device::match_template::extractFirstChannel_32F(cv::gpu::PtrStepSzb, cv::gpu::PtrStepSzf, int, CUstream_st)’ [-Wmissing-prototypes] [ 71%] Building NVCC (Device) object modules/gpu/CMakeFiles/cuda_compile.dir/src/cuda/./cuda_compile_generated_matrix_reductions.cu.o /Users/michael/Documents/project/opencv/modules/gpu/src/cuda/mathfunc.cu:154: warning: no previous prototype for ‘void cv::gpu::device::mathfunc::cartToPolar_gpu(cv::gpu::PtrStepSzf, cv::gpu::PtrStepSzf, cv::gpu::PtrStepSzf, bool, cv::gpu::PtrStepSzf, bool, CUstream_st)’ [-Wmissing-prototypes] /Users/michael/Documents/project/opencv/modules/gpu/src/cuda/mathfunc.cu:203: warning: no previous prototype for ‘void cv::gpu::device::mathfunc::polarToCart_gpu(cv::gpu::PtrStepSzf, cv::gpu::PtrStepSzf, cv::gpu::PtrStepSzf, cv::gpu::PtrStepSzf, bool, CUstream_st)’ [-Wmissing-prototypes] [ 71%] Building NVCC (Device) object modules/gpu/CMakeFiles/cuda_compile.dir/src/cuda/./cuda_compile_generated_nlm.cu.o /Users/michael/Documents/project/opencv/modules/gpu/src/cuda/nlm.cu:483: warning: no previous prototype for ‘void cv::gpu::device::imgproc::nln_fast_get_buffer_size(const cv::gpu::PtrStepSzb&, int, int, int&, int&)’ [-Wmissing-prototypes] /Users/michael/Documents/project/opencv/modules/gpu/src/cuda/nlm.cu:532: warning: no previous prototype for ‘void cv::gpu::device::imgproc::fnlm_split_channels(const cv::gpu::PtrStepSz<uchar3>&, cv::gpu::PtrStepb, cv::gpu::PtrStep<uchar2>, CUstream_st)’ [-Wmissing-prototypes] /Users/michael/Documents/project/opencv/modules/gpu/src/cuda/nlm.cu:555: warning: no previous prototype for ‘void cv::gpu::device::imgproc::fnlm_merge_channels(const cv::gpu::PtrStepb&, const cv::gpu::PtrStep<uchar2>&, cv::gpu::PtrStepSz<uchar3>, CUstream_st)’ [-Wmissing-prototypes] [ 71%] Building NVCC (Device) object modules/gpu/CMakeFiles/cuda_compile.dir/src/cuda/./cuda_compile_generated_NV12ToARGB.cu.o /Users/michael/Documents/project/opencv/modules/gpu/src/cuda/NV12ToARGB.cu:61: warning: no previous prototype for ‘void cv::gpu::device::video_decoding::loadHueCSC(float)’ [-Wmissing-prototypes] /Users/michael/Documents/project/opencv/modules/gpu/src/cuda/NV12ToARGB.cu:66: warning: no previous prototype for ‘void cv::gpu::device::video_decoding::YUV2RGB(const cv::gpu::device::uint, float, float, float)’ [-Wmissing-prototypes] /Users/michael/Documents/project/opencv/modules/gpu/src/cuda/NV12ToARGB.cu:89: warning: no previous prototype for ‘cv::gpu::device::uint cv::gpu::device::video_decoding::RGBAPACK_10bit(float, float, float, cv::gpu::device::uint)’ [-Wmissing-prototypes] /Users/michael/Documents/project/opencv/modules/gpu/src/cuda/NV12ToARGB.cu:185: warning: no previous prototype for ‘void cv::gpu::device::video_decoding::NV12ToARGB_gpu(cv::gpu::PtrStepb, cv::gpu::PtrStepSz<unsigned int="">, CUstream_st)’ [-Wmissing-prototypes] [ 71%] Building NVCC (Device) object modules/gpu/CMakeFiles/cuda_compile.dir/src/cuda/./cuda_compile_generated_optflowbm.cu.o /Users/michael/Documents/project/opencv/modules/gpu/src/cuda/optflowbm.cu:58: warning: no previous prototype for ‘int optflowbm::cmpBlocks(int, int, int, int, int2)’ [-Wmissing-prototypes] /Users/michael/Documents/project/opencv/modules/gpu/src/cuda/optflowbm.cu:152: warning: no previous prototype for ‘void optflowbm::calc(cv::gpu::PtrStepSzb, cv::gpu::PtrStepSzb, cv::gpu::PtrStepSzf, cv::gpu::PtrStepSzf, int2, int2, bool, int, int, int, int, const short2, int, CUstream_st)’ [-Wmissing-prototypes] /Users/michael/Documents/project/opencv/modules/gpu/src/cuda/optflowbm.cu:386: warning: no previous prototype for ‘void optflowbm_fast::get_buffer_size(int, int, int, int, int&, int&)’ [-Wmissing-prototypes] [ 71%] Building NVCC (Device) object modules/gpu/CMakeFiles/cuda_compile.dir/src/cuda/./cuda_compile_generated_optical_flow.cu.o /Users/michael/Documents/project/opencv/modules/gpu/src/cuda/hough.cu:120: warning: no previous prototype for ‘int cv::gpu::device::hough::buildPointList_gpu(cv::gpu::PtrStepSzb, unsigned int)’ [-Wmissing-prototypes] /Users/michael/Documents/project/opencv/modules/gpu/src/cuda/hough.cu:216: warning: no previous prototype for ‘void cv::gpu::device::hough::linesAccum_gpu(const unsigned int, int, cv::gpu::PtrStepSzi, float, float, size_t, bool)’ [-Wmissing-prototypes] /Users/michael/Documents/project/opencv/modules/gpu/src/cuda/hough.cu:264: warning: no previous prototype for ‘int cv::gpu::device::hough::linesGetResult_gpu(cv::gpu::PtrStepSzi, float2, int, int, float, float, int, bool)’ [-Wmissing-prototypes] /Users/michael/Documents/project/opencv/modules/gpu/src/cuda/hough.cu:462: warning: no previous prototype for ‘int cv::gpu::device::hough::houghLinesProbabilistic_gpu(cv::gpu::PtrStepSzb, cv::gpu::PtrStepSzi, int4, int, float, float, int, int)’ [-Wmissing-prototypes] /Users/michael/Documents/project/opencv/modules/gpu/src/cuda/hough.cu:546: warning: no previous prototype for ‘void cv::gpu::device::hough::circlesAccumCenters_gpu(const unsigned int, int, cv::gpu::PtrStepi, cv::gpu::PtrStepi, cv::gpu::PtrStepSzi, int, int, float)’ [-Wmissing-prototypes] /Users/michael/Documents/project/opencv/modules/gpu/src/cuda/hough.cu:586: warning: no previous prototype for ‘int cv::gpu::device::hough::buildCentersList_gpu(cv::gpu::PtrStepSzi, unsigned int, int)’ [-Wmissing-prototypes] /Users/michael/Documents/project/opencv/modules/gpu/src/cuda/hough.cu:662: warning: no previous prototype for ‘int cv::gpu::device::hough::circlesAccumRadius_gpu(const unsigned int, int, const unsigned int, int, float3, int, float, int, int, int, bool)’ [-Wmissing-prototypes] /Users/michael/Documents/project/opencv/modules/gpu/src/cuda/hough.cu:819: warning: no previous prototype for ‘void cv::gpu::device::hough::buildRTable_gpu(const unsigned int, const float, int, cv::gpu::PtrStepSz<short2>, int, short2, int)’ [-Wmissing-prototypes] /Users/michael/Documents/project/opencv/modules/gpu/src/cuda/hough.cu:871: warning: no previous prototype for ‘void cv::gpu::device::hough::GHT_Ballard_Pos_calcHist_gpu(const unsigned int, const float, int, cv::gpu::PtrStepSz<short2>, const int, cv::gpu::PtrStepSzi, float, int)’ [-Wmissing-prototypes] /Users/michael/Documents/project/opencv/modules/gpu/src/cuda/hough.cu:911: warning: no previous prototype for ‘int cv::gpu::device::hough::GHT_Ballard_Pos_findPosInHist_gpu(cv::gpu::PtrStepSzi, float4, int3, int, float, int)’ [-Wmissing-prototypes] /Users/michael/Documents/project/opencv/modules/gpu/src/cuda/hough.cu:979: warning: no previous prototype for ‘void cv::gpu::device::hough::GHT_Ballard_PosScale_calcHist_gpu(const unsigned int, const float, int, cv::gpu::PtrStepSz<short2>, const int, cv::gpu::PtrStepi, int, int, float, float, int, float, int)’ [-Wmissing-prototypes] /Users/michael/Documents/project/opencv/modules/gpu/src/cuda/hough.cu:1037: warning: no previous prototype for ‘int cv::gpu::device::hough::GHT_Ballard_PosScale_findPosInHist_gpu(cv::gpu::PtrStepi, int, int, int, float4, int3, int, float, float, float, int)’ [-Wmissing-prototypes] /Users/michael/Documents/project/opencv/modules/gpu/src/cuda/hough.cu:1113: warning: no previous prototype for ‘void cv::gpu::device::hough::GHT_Ballard_PosRotation_calcHist_gpu(const unsigned int, const float, int, cv::gpu::PtrStepSz<short2>, const int, cv::gpu::PtrStepi, int, int, float, float, int, float, int)’ [-Wmissing-prototypes] /Users/michael/Documents/project/opencv/modules/gpu/src/cuda/hough.cu:1171: warning: no previous prototype for ‘int cv::gpu::device::hough::GHT_Ballard_PosRotation_findPosInHist_gpu(cv::gpu::PtrStepi, int, int, int, float4, int3, int, float, float, float, int)’ [-Wmissing-prototypes] /Users/michael/Documents/project/opencv/modules/gpu/src/cuda/hough.cu:1223: warning: no previous prototype for ‘void cv::gpu::device::hough::GHT_Guil_Full_setTemplFeatures(cv::gpu::PtrStepb, cv::gpu::PtrStepb, cv::gpu::PtrStepb, cv::gpu::PtrStepb, cv::gpu::PtrStepb, cv::gpu::PtrStepb)’ [-Wmissing-prototypes] /Users/michael/Documents/project/opencv/modules/gpu/src/cuda/hough.cu:1247: warning: no previous prototype for ‘void cv::gpu::device::hough::GHT_Guil_Full_setImageFeatures(cv::gpu::PtrStepb, cv::gpu::PtrStepb, cv::gpu::PtrStepb, cv::gpu::PtrStepb, cv::gpu::PtrStepb, cv::gpu::PtrStepb)’ [-Wmissing-prototypes] /Users/michael/Documents/project/opencv/modules/gpu/src/cuda/hough.cu:1331: warning: no previous prototype for ‘float cv::gpu::device::hough::clampAngle(float)’ [-Wmissing-prototypes] /Users/michael/Documents/project/opencv/modules/gpu/src/cuda/hough.cu:1343: warning: no previous prototype for ‘bool cv::gpu::device::hough::angleEq(float, float, float)’ [-Wmissing-prototypes] /Users/michael/Documents/project/opencv/modules/gpu/src/cuda/hough.cu:1433: warning: no previous prototype for ‘void cv::gpu::device::hough::GHT_Guil_Full_buildTemplFeatureList_gpu(const unsigned int, const float, int, int, int, float, float, int, float2, float)’ [-Wmissing-prototypes] /Users/michael/Documents/project/opencv/modules/gpu/src/cuda/hough.cu:1443: warning: no previous prototype for ‘void cv::gpu::device::hough::GHT_Guil_Full_buildImageFeatureList_gpu(const unsigned int, const float, int, int, int, float, float, int, float2, float)’ [-Wmissing-prototypes] /Users/michael/Documents/project/opencv/modules/gpu/src/cuda/hough.cu:1491: warning: no previous prototype for ‘void cv::gpu::device::hough::GHT_Guil_Full_calcOHist_gpu(const int, const int, int, float, float, float, int, int, int)’ [-Wmissing-prototypes] /Users/michael/Documents/project/opencv/modules/gpu/src/cuda/hough.cu:1556: warning: no previous prototype for ‘void cv::gpu::device::hough::GHT_Guil_Full_calcSHist_gpu(const int, const int, int, float, float, float, float, float, int, int, int)’ [-Wmissing-prototypes] /Users/michael/Documents/project/opencv/modules/gpu/src/cuda/hough.cu:1628: warning: no previous prototype for ‘void cv::gpu::device::hough::GHT_Guil_Full_calcPHist_gpu(const int, const int, cv::gpu::PtrStepSzi, float, float, float, float, int, int)’ [-Wmissing-prototypes] /Users/michael/Documents/project/opencv/modules/gpu/src/cuda/hough.cu:1679: warning: no previous prototype for ‘int cv::gpu::device::hough::GHT_Guil_Full_findPosInHist_gpu(cv::gpu::PtrStepSzi, float4, int3, int, int, float, int, float, int, float, int)’ [-Wmissing-prototypes] [ 71%] Building NVCC (Device) object modules/gpu/CMakeFiles/cuda_compile.dir/src/cuda/./cuda_compile_generated_optical_flow_farneback.cu.o /Users/michael/Documents/project/opencv/modules/gpu/src/cuda/optical_flow.cu:116: warning: no previous prototype for ‘void cv::gpu::device::optical_flow::NeedleMapAverage_gpu(cv::gpu::PtrStepSzf, cv::gpu::PtrStepSzf, cv::gpu::PtrStepSzf, cv::gpu::PtrStepSzf)’ [-Wmissing-prototypes] /Users/michael/Documents/project/opencv/modules/gpu/src/cuda/optical_flow.cu:207: warning: no previous prototype for ‘void cv::gpu::device::optical_flow::CreateOpticalFlowNeedleMap_gpu(cv::gpu::PtrStepSzf, cv::gpu::PtrStepSzf, float, float, float, float, float)’ [-Wmissing-prototypes] [ 71%] Building NVCC (Device) object modules/gpu/CMakeFiles/cuda_compile.dir/src/cuda/./cuda_compile_generated_orb.cu.o /Users/michael/Documents/project/opencv/modules/gpu/src/cuda/optical_flow_farneback.cu:124: warning: no previous prototype for ‘void cv::gpu::device::optflow_farneback::setPolynomialExpansionConsts(int, const float, const float, const float, float, float, float, float)’ [-Wmissing-prototypes] /Users/michael/Documents/project/opencv/modules/gpu/src/cuda/optical_flow_farneback.cu:136: warning: no previous prototype for ‘void cv::gpu::device::optflow_farneback::polynomialExpansionGpu(const cv::gpu::PtrStepSzf&, int, cv::gpu::PtrStepSzf, CUstream_st)’ [-Wmissing-prototypes] /Users/michael/Documents/project/opencv/modules/gpu/src/cuda/optical_flow_farneback.cu:244: warning: no previous prototype for ‘void cv::gpu::device::optflow_farneback::setUpdateMatricesConsts()’ [-Wmissing-prototypes] /Users/michael/Documents/project/opencv/modules/gpu/src/cuda/optical_flow_farneback.cu:253: warning: no previous prototype for ‘void cv::gpu::device::optflow_farneback::updateMatricesGpu(cv::gpu::PtrStepSzf, cv::gpu::PtrStepSzf, cv::gpu::PtrStepSzf, cv::gpu::PtrStepSzf, cv::gpu::PtrStepSzf, CUstream_st)’ [-Wmissing-prototypes] /Users/michael/Documents/project/opencv/modules/gpu/src/cuda/optical_flow_farneback.cu:289: warning: no previous prototype for ‘void cv::gpu::device::optflow_farneback::updateFlowGpu(cv::gpu::PtrStepSzf, cv::gpu::PtrStepSzf, cv::gpu::PtrStepSzf, CUstream_st)’ [-Wmissing-prototypes] /Users/michael/Documents/project/opencv/modules/gpu/src/cuda/optical_flow_farneback.cu:415: warning: no previous prototype for ‘void cv::gpu::device::optflow_farneback::boxFilter5Gpu(cv::gpu::PtrStepSzf, int, cv::gpu::PtrStepSzf, CUstream_st)’ [-Wmissing-prototypes] /Users/michael/Documents/project/opencv/modules/gpu/src/cuda/optical_flow_farneback.cu:434: warning: no previous prototype for ‘void cv::gpu::device::optflow_farneback::boxFilter5Gpu_CC11(cv::gpu::PtrStepSzf, int, cv::gpu::PtrStepSzf, CUstream_st)’ [-Wmissing-prototypes] /Users/michael/Documents/project/opencv/modules/gpu/src/cuda/optical_flow_farneback.cu:495: warning: no previous prototype for ‘void cv::gpu::device::optflow_farneback::setGaussianBlurKernel(const float, int)’ [-Wmissing-prototypes] /Users/michael/Documents/project/opencv/modules/gpu/src/cuda/optical_flow_farneback.cu:522: warning: no previous prototype for ‘void cv::gpu::device::optflow_farneback::gaussianBlurGpu(cv::gpu::PtrStepSzf, int, cv::gpu::PtrStepSzf, int, CUstream_st)’ [-Wmissing-prototypes] /Users/michael/Documents/project/opencv/modules/gpu/src/cuda/optical_flow_farneback.cu:617: warning: no previous prototype for ‘void cv::gpu::device::optflow_farneback::gaussianBlur5Gpu(cv::gpu::PtrStepSzf, int, cv::gpu::PtrStepSzf, int, CUstream_st)’ [-Wmissing-prototypes] /Users/michael/Documents/project/opencv/modules/gpu/src/cuda/optical_flow_farneback.cu:631: warning: no previous prototype for ‘void cv::gpu::device::optflow_farneback::gaussianBlur5Gpu_CC11(cv::gpu::PtrStepSzf, int, cv::gpu::PtrStepSzf, int, CUstream_st)’ [-Wmissing-prototypes] [ 72%] Building NVCC (Device) object modules/gpu/CMakeFiles/cuda_compile.dir/src/cuda/./cuda_compile_generated_pyr_down.cu.o ptxas /tmp/tmpxft_000058a9_00000000-17_orb.compute_11.ptx, line 36987; warning : Double is not supported. Demoting to float ptxas /tmp/tmpxft_000054a2_00000000-17_matrix_reductions.compute_11.ptx, line 18968; warning : Double is not supported. Demoting to float [ 72%] Building NVCC (Device) object modules/gpu/CMakeFiles/cuda_compile.dir/src/cuda/./cuda_compile_generated_pyr_up.cu.o ptxas /tmp/tmpxft_000058a9_00000000-14_orb.compute_12.ptx, line 42622; warning : Double is not supported. Demoting to float [ 72%] Building NVCC (Device) object modules/gpu/CMakeFiles/cuda_compile.dir/src/cuda/./cuda_compile_generated_pyrlk.cu.o /Users/michael/Documents/project/opencv/modules/gpu/src/cuda/element_operations.cu:217: warning: no previous prototype for ‘void arithm::addMat_v4(cv::gpu::PtrStepSz<unsigned int="">, cv::gpu::PtrStepSz<unsigned int="">, cv::gpu::PtrStepSz<unsigned int="">, CUstream_st)’ [-Wmissing-prototypes] /Users/michael/Documents/project/opencv/modules/gpu/src/cuda/element_operations.cu:222: warning: no previous prototype for ‘void arithm::addMat_v2(cv::gpu::PtrStepSz<unsigned int="">, cv::gpu::PtrStepSz<unsigned int="">, cv::gpu::PtrStepSz<unsigned int="">, CUstream_st)’ [-Wmissing-prototypes] /Users/michael/Documents/project/opencv/modules/gpu/src/cuda/element_operations.cu:452: warning: no previous prototype for ‘void arithm::subMat_v4(cv::gpu::PtrStepSz<unsigned int="">, cv::gpu::PtrStepSz<unsigned int="">, cv::gpu::PtrStepSz<unsigned int="">, CUstream_st)’ [-Wmissing-prototypes] /Users/michael/Documents/project/opencv/modules/gpu/src/cuda/element_operations.cu:457: warning: no previous prototype for ‘void arithm::subMat_v2(cv::gpu::PtrStepSz<unsigned int="">, cv::gpu::PtrStepSz<unsigned int="">, cv::gpu::PtrStepSz<unsigned int="">, CUstream_st)’ [-Wmissing-prototypes] /Users/michael/Documents/project/opencv/modules/gpu/src/cuda/element_operations.cu:677: warning: no previous prototype for ‘void arithm::mulMat_8uc4_32f(cv::gpu::PtrStepSz<unsigned int="">, cv::gpu::PtrStepSzf, cv::gpu::PtrStepSz<unsigned int="">, CUstream_st)’ [-Wmissing-prototypes] /Users/michael/Documents/project/opencv/modules/gpu/src/cuda/element_operations.cu:682: warning: no previous prototype for ‘void arithm::mulMat_16sc4_32f(cv::gpu::PtrStepSz<short4>, cv::gpu::PtrStepSzf, cv::gpu::PtrStepSz<short4>, CUstream_st)’ [-Wmissing-prototypes] /Users/michael/Documents/project/opencv/modules/gpu/src/cuda/element_operations.cu:945: warning: no previous prototype for ‘void arithm::divMat_8uc4_32f(cv::gpu::PtrStepSz<unsigned int="">, cv::gpu::PtrStepSzf, cv::gpu::PtrStepSz<unsigned int="">, CUstream_st)’ [-Wmissing-prototypes] /Users/michael/Documents/project/opencv/modules/gpu/src/cuda/element_operations.cu:950: warning: no previous prototype for ‘void arithm::divMat_16sc4_32f(cv::gpu::PtrStepSz<short4>, cv::gpu::PtrStepSzf, cv::gpu::PtrStepSz<short4>, CUstream_st)’ [-Wmissing-prototypes] /Users/michael/Documents/project/opencv/modules/gpu/src/cuda/element_operations.cu:1264: warning: no previous prototype for ‘void arithm::absDiffMat_v4(cv::gpu::PtrStepSz<unsigned int="">, cv::gpu::PtrStepSz<unsigned int="">, cv::gpu::PtrStepSz<unsigned int="">, CUstream_st)’ [-Wmissing-prototypes] /Users/michael/Documents/project/opencv/modules/gpu/src/cuda/element_operations.cu:1269: warning: no previous prototype for ‘void arithm::absDiffMat_v2(cv::gpu::PtrStepSz<unsigned int="">, cv::gpu::PtrStepSz<unsigned int="">, cv::gpu::PtrStepSz<unsigned int="">, CUstream_st)’ [-Wmissing-prototypes] /Users/michael/Documents/project/opencv/modules/gpu/src/cuda/element_operations.cu:1581: warning: no previous prototype for ‘void arithm::cmpMatEq_v4(cv::gpu::PtrStepSz<unsigned int="">, cv::gpu::PtrStepSz<unsigned int="">, cv::gpu::PtrStepSz<unsigned int="">, CUstream_st)’ [-Wmissing-prototypes] /Users/michael/Documents/project/opencv/modules/gpu/src/cuda/element_operations.cu:1585: warning: no previous prototype for ‘void arithm::cmpMatNe_v4(cv::gpu::PtrStepSz<unsigned int="">, cv::gpu::PtrStepSz<unsigned int="">, cv::gpu::PtrStepSz<unsigned int="">, CUstream_st)’ [-Wmissing-prototypes] /Users/michael/Documents/project/opencv/modules/gpu/src/cuda/element_operations.cu:1589: warning: no previous prototype for ‘void arithm::cmpMatLt_v4(cv::gpu::PtrStepSz<unsigned int="">, cv::gpu::PtrStepSz<unsigned int="">, cv::gpu::PtrStepSz<unsigned int="">, CUstream_st)’ [-Wmissing-prototypes] /Users/michael/Documents/project/opencv/modules/gpu/src/cuda/element_operations.cu:1593: warning: no previous prototype for ‘void arithm::cmpMatLe_v4(cv::gpu::PtrStepSz<unsigned int="">, cv::gpu::PtrStepSz<unsigned int="">, cv::gpu::PtrStepSz<unsigned int="">, CUstream_st)’ [-Wmissing-prototypes] /Users/michael/Documents/project/opencv/modules/gpu/src/cuda/element_operations.cu:2054: warning: no previous prototype for ‘void arithm::minMat_v4(cv::gpu::PtrStepSz<unsigned int="">, cv::gpu::PtrStepSz<unsigned int="">, cv::gpu::PtrStepSz<unsigned int="">, CUstream_st)’ [-Wmissing-prototypes] /Users/michael/Documents/project/opencv/modules/gpu/src/cuda/element_operations.cu:2059: warning: no previous prototype for ‘void arithm::minMat_v2(cv::gpu::PtrStepSz<unsigned int="">, cv::gpu::PtrStepSz<unsigned int="">, cv::gpu::PtrStepSz<unsigned int="">, CUstream_st)’ [-Wmissing-prototypes] /Users/michael/Documents/project/opencv/modules/gpu/src/cuda/element_operations.cu:2146: warning: no previous prototype for ‘void arithm::maxMat_v4(cv::gpu::PtrStepSz<unsigned int="">, cv::gpu::PtrStepSz<unsigned int="">, cv::gpu::PtrStepSz<unsigned int="">, CUstream_st)’ [-Wmissing-prototypes] /Users/michael/Documents/project/opencv/modules/gpu/src/cuda/element_operations.cu:2151: warning: no previous prototype for ‘void arithm::maxMat_v2(cv::gpu::PtrStepSz<unsigned int="">, cv::gpu::PtrStepSz<unsigned int="">, cv::gpu::PtrStepSz<unsigned int="">, CUstream_st)’ [-Wmissing-prototypes] /Users/michael/Documents/project/opencv/modules/gpu/src/cuda/orb.cu:59: warning: no previous prototype for ‘int cv::gpu::device::orb::cull_gpu(int, float, int, int)’ [-Wmissing-prototypes] /Users/michael/Documents/project/opencv/modules/gpu/src/cuda/orb.cu:126: warning: no previous prototype for ‘void cv::gpu::device::orb::HarrisResponses_gpu(cv::gpu::PtrStepSzb, const short2, float, int, int, float, CUstream_st)’ [-Wmissing-prototypes] /Users/michael/Documents/project/opencv/modules/gpu/src/cuda/orb.cu:146: warning: no previous prototype for ‘void cv::gpu::device::orb::loadUMax(const int, int)’ [-Wmissing-prototypes] /Users/michael/Documents/project/opencv/modules/gpu/src/cuda/orb.cu:208: warning: no previous prototype for ‘void cv::gpu::device::orb::IC_Angle_gpu(cv::gpu::PtrStepSzb, const short2, float, int, int, CUstream_st)’ [-Wmissing-prototypes] /Users/michael/Documents/project/opencv/modules/gpu/src/cuda/orb.cu:362: warning: no previous prototype for ‘void cv::gpu::device::orb::computeOrbDescriptor_gpu(cv::gpu::PtrStepb, const short2, const float, int, const int, const int, cv::gpu::PtrStepb, int, int, CUstream_st)’ [-Wmissing-prototypes] /Users/michael/Documents/project/opencv/modules/gpu/src/cuda/orb.cu:407: warning: no previous prototype for ‘void cv::gpu::device::orb::mergeLocation_gpu(const short2, float, float, int, float, CUstream_st)’ [-Wmissing-prototypes] [ 72%] Building NVCC (Device) object modules/gpu/CMakeFiles/cuda_compile.dir/src/cuda/./cuda_compile_generated_remap.cu.o ptxas /tmp/tmpxft_000054a2_00000000-14_matrix_reductions.compute_12.ptx, line 18968; warning : Double is not supported. Demoting to float [ 72%] Building NVCC (Device) object modules/gpu/CMakeFiles/cuda_compile.dir/src/cuda/./cuda_compile_generated_resize.cu.o [ 72%] Building NVCC (Device) object modules/gpu/CMakeFiles/cuda_compile.dir/src/cuda/./cuda_compile_generated_rgb_to_yv12.cu.o /Users/michael/Documents/project/opencv/modules/gpu/src/cuda/rgb_to_yv12.cu:137: warning: no previous prototype for ‘void cv::gpu::device::video_encoding::Gray_to_YV12_caller(cv::gpu::PtrStepSzb, cv::gpu::PtrStepb)’ [-Wmissing-prototypes] /Users/michael/Documents/project/opencv/modules/gpu/src/cuda/rgb_to_yv12.cu:161: warning: no previous prototype for ‘void cv::gpu::device::video_encoding::YV12_gpu(cv::gpu::PtrStepSzb, int, cv::gpu::PtrStepSzb)’ [-Wmissing-prototypes] [ 72%] Building NVCC (Device) object modules/gpu/CMakeFiles/cuda_compile.dir/src/cuda/./cuda_compile_generated_row_filter.0.cu.o [ 72%] Building NVCC (Device) object modules/gpu/CMakeFiles/cuda_compile.dir/src/cuda/./cuda_compile_generated_row_filter.1.cu.o /Users/michael/Documents/project/opencv/modules/gpu/src/cuda/matrix_reductions.cu:394: warning: no previous prototype for ‘void sum::getLaunchCfg(int, int, dim3&, dim3&)’ [-Wmissing-prototypes] /Users/michael/Documents/project/opencv/modules/gpu/src/cuda/matrix_reductions.cu:405: warning: no previous prototype for ‘void sum::getBufSize(int, int, int, int&, int&)’ [-Wmissing-prototypes] /Users/michael/Documents/project/opencv/modules/gpu/src/cuda/matrix_reductions.cu:701: warning: no previous prototype for ‘void minMax::getLaunchCfg(int, int, dim3&, dim3&)’ [-Wmissing-prototypes] /Users/michael/Documents/project/opencv/modules/gpu/src/cuda/matrix_reductions.cu:712: warning: no previous prototype for ‘void minMax::getBufSize(int, int, int&, int&)’ [-Wmissing-prototypes] /Users/michael/Documents/project/opencv/modules/gpu/src/cuda/matrix_reductions.cu:893: warning: no previous prototype for ‘void minMaxLoc::getLaunchCfg(int, int, dim3&, dim3&)’ [-Wmissing-prototypes] /Users/michael/Documents/project/opencv/modules/gpu/src/cuda/matrix_reductions.cu:904: warning: no previous prototype for ‘void minMaxLoc::getBufSize(int, int, size_t, int&, int&, int&, int&)’ [-Wmissing-prototypes] /Users/michael/Documents/project/opencv/modules/gpu/src/cuda/matrix_reductions.cu:1037: warning: no previous prototype for ‘void countNonZero::getLaunchCfg(int, int, dim3&, dim3&)’ [-Wmissing-prototypes] /Users/michael/Documents/project/opencv/modules/gpu/src/cuda/matrix_reductions.cu:1048: warning: no previous prototype for ‘void countNonZero::getBufSize(int, int, int&, int&)’ [-Wmissing-prototypes] [ 72%] Building NVCC (Device) object modules/gpu/CMakeFiles/cuda_compile.dir/src/cuda/./cuda_compile_generated_row_filter.10.cu.o /Users/michael/Documents/project/opencv/modules/gpu/src/cuda/pyrlk.cu:475: warning: no previous prototype for ‘void pyrlk::loadConstants(int2, int)’ [-Wmissing-prototypes] /Users/michael/Documents/project/opencv/modules/gpu/src/cuda/pyrlk.cu:488: warning: no previous prototype for ‘void pyrlk::sparse1(cv::gpu::PtrStepSzf, cv::gpu::PtrStepSzf, const float2, float2, cv::gpu::device::uchar, float, int, int, dim3, dim3, CUstream_st)’ [-Wmissing-prototypes] /Users/michael/Documents/project/opencv/modules/gpu/src/cuda/pyrlk.cu:510: warning: no previous prototype for ‘void pyrlk::sparse4(cv::gpu::PtrStepSz<float4>, cv::gpu::PtrStepSz<float4>, const float2, float2, cv::gpu::device::uchar, float, int, int, dim3, dim3, CUstream_st)’ [-Wmissing-prototypes] /Users/michael/Documents/project/opencv/modules/gpu/src/cuda/pyrlk.cu:531: warning: no previous prototype for ‘void pyrlk::dense(cv::gpu::PtrStepSzb, cv::gpu::PtrStepSzf, cv::gpu::PtrStepSzf, cv::gpu::PtrStepSzf, cv::gpu::PtrStepSzf, cv::gpu::PtrStepSzf, cv::gpu::PtrStepSzf, int2, CUstream_st)’ [-Wmissing-prototypes] [ 72%] Building NVCC (Device) object modules/gpu/CMakeFiles/cuda_compile.dir/src/cuda/./cuda_compile_generated_row_filter.11.cu.o [ 72%] Building NVCC (Device) object modules/gpu/CMakeFiles/cuda_compile.dir/src/cuda/./cuda_compile_generated_row_filter.12.cu.o [ 72%] Building NVCC (Device) object modules/gpu/CMakeFiles/cuda_compile.dir/src/cuda/./cuda_compile_generated_row_filter.13.cu.o [ 72%] Building NVCC (Device) object modules/gpu/CMakeFiles/cuda_compile.dir/src/cuda/./cuda_compile_generated_row_filter.14.cu.o [ 72%] Building NVCC (Device) object modules/gpu/CMakeFiles/cuda_compile.dir/src/cuda/./cuda_compile_generated_row_filter.2.cu.o [ 73%] Building NVCC (Device) object modules/gpu/CMakeFiles/cuda_compile.dir/src/cuda/./cuda_compile_generated_row_filter.3.cu.o [ 73%] Building NVCC (Device) object modules/gpu/CMakeFiles/cuda_compile.dir/src/cuda/./cuda_compile_generated_row_filter.4.cu.o [ 73%] Building NVCC (Device) object modules/gpu/CMakeFiles/cuda_compile.dir/src/cuda/./cuda_compile_generated_row_filter.5.cu.o [ 73%] Building NVCC (Device) object modules/gpu/CMakeFiles/cuda_compile.dir/src/cuda/./cuda_compile_generated_row_filter.6.cu.o [ 73%] Building NVCC (Device) object modules/gpu/CMakeFiles/cuda_compile.dir/src/cuda/./cuda_compile_generated_row_filter.7.cu.o [ 73%] Building NVCC (Device) object modules/gpu/CMakeFiles/cuda_compile.dir/src/cuda/./cuda_compile_generated_row_filter.8.cu.o [ 73%] Building NVCC (Device) object modules/gpu/CMakeFiles/cuda_compile.dir/src/cuda/./cuda_compile_generated_row_filter.9.cu.o [ 73%] Building NVCC (Device) object modules/gpu/CMakeFiles/cuda_compile.dir/src/cuda/./cuda_compile_generated_split_merge.cu.o ptxas /tmp/tmpxft_000068de_00000000-17_split_merge.compute_11.ptx, line 109; warning : Double is not supported. Demoting to float ptxas /tmp/tmpxft_000068de_00000000-14_split_merge.compute_12.ptx, line 109; warning : Double is not supported. Demoting to float /Users/michael/Documents/project/opencv/modules/gpu/src/cuda/split_merge.cu:283: warning: no previous prototype for ‘void cv::gpu::device::split_merge::merge_caller(const cv::gpu::PtrStepSzb, cv::gpu::PtrStepSzb&, int, size_t, CUstream_st* const&)’ [-Wmissing-prototypes] /Users/michael/Documents/project/opencv/modules/gpu/src/cuda/split_merge.cu:490: warning: no previous prototype for ‘void cv::gpu::device::split_merge::split_caller(const cv::gpu::PtrStepSzb&, cv::gpu::PtrStepSzb, int, size_t, CUstream_st const&)’ [-Wmissing-prototypes] [ 73%] Building NVCC (Device) object modules/gpu/CMakeFiles/cuda_compile.dir/src/cuda/./cuda_compile_generated_stereobm.cu.o [ 73%] Building NVCC (Device) object modules/gpu/CMakeFiles/cuda_compile.dir/src/cuda/./cuda_compile_generated_stereobp.cu.o /Users/michael/Documents/project/opencv/modules/gpu/src/cuda/stereobp.cu:63: warning: no previous prototype for ‘void cv::gpu::device::stereobp::load_constants(int, float, float, float, float)’ [-Wmissing-prototypes] [ 73%] Building NVCC (Device) object modules/gpu/CMakeFiles/cuda_compile.dir/src/cuda/./cuda_compile_generated_stereocsbp.cu.o /Users/michael/Documents/project/opencv/modules/gpu/src/cuda/stereobm.cu:346: warning: no previous prototype for ‘void cv::gpu::device::stereobm::stereoBM_GPU(const cv::gpu::PtrStepSzb&, const cv::gpu::PtrStepSzb&, const cv::gpu::PtrStepSzb&, int, int, const cv::gpu::PtrStepSz<unsigned int="">&, CUstream_st&)’ [-Wmissing-prototypes] /Users/michael/Documents/project/opencv/modules/gpu/src/cuda/stereobm.cu:392: warning: no previous prototype for ‘void cv::gpu::device::stereobm::prefilter_xsobel(const cv::gpu::PtrStepSzb&, const cv::gpu::PtrStepSzb&, int, CUstream_st&)’ [-Wmissing-prototypes] /Users/michael/Documents/project/opencv/modules/gpu/src/cuda/stereobm.cu:427: warning: no previous prototype for ‘float cv::gpu::device::stereobm::CalcSums(float, float, int)’ [-Wmissing-prototypes] /Users/michael/Documents/project/opencv/modules/gpu/src/cuda/stereobm.cu:510: warning: no previous prototype for ‘void cv::gpu::device::stereobm::postfilter_textureness(const cv::gpu::PtrStepSzb&, int, float, const cv::gpu::PtrStepSzb&, CUstream_st*&)’ [-Wmissing-prototypes] [ 73%] Building NVCC (Device) object modules/gpu/CMakeFiles/cuda_compile.dir/src/cuda/./cuda_compile_generated_tvl1flow.cu.o /Users/michael/Documents/project/opencv/modules/gpu/src/cuda/stereocsbp.cu:79: warning: no previous prototype for ‘void cv::gpu::device::stereocsbp::load_constants(int, float, float, float, float, int, const cv::gpu::PtrStepSzb&, const cv::gpu::PtrStepSzb&, const cv::gpu::PtrStepSzb&)’ [-Wmissing-prototypes] [ 73%] Building NVCC (Device) object modules/gpu/CMakeFiles/cuda_compile.dir/src/cuda/./cuda_compile_generated_warp.cu.o /Users/michael/Documents/project/opencv/modules/gpu/src/cuda/tvl1flow.cu:69: warning: no previous prototype for ‘void tvl1flow::centeredGradient(cv::gpu::PtrStepSzf, cv::gpu::PtrStepSzf, cv::gpu::PtrStepSzf)’ [-Wmissing-prototypes] /Users/michael/Documents/project/opencv/modules/gpu/src/cuda/tvl1flow.cu:167: warning: no previous prototype for ‘void tvl1flow::warpBackward(cv::gpu::PtrStepSzf, cv::gpu::PtrStepSzf, cv::gpu::PtrStepSzf, cv::gpu::PtrStepSzf, cv::gpu::PtrStepSzf, cv::gpu::PtrStepSzf, cv::gpu::PtrStepSzf, cv::gpu::PtrStepSzf, cv::gpu::PtrStepSzf, cv::gpu::PtrStepSzf, cv::gpu::PtrStepSzf)’ [-Wmissing-prototypes] /Users/michael/Documents/project/opencv/modules/gpu/src/cuda/tvl1flow.cu:188: warning: no previous prototype for ‘float tvl1flow::divergence(const cv::gpu::PtrStepf&, const cv::gpu::PtrStepf&, int, int)’ [-Wmissing-prototypes] /Users/michael/Documents/project/opencv/modules/gpu/src/cuda/tvl1flow.cu:277: warning: no previous prototype for ‘void tvl1flow::estimateU(cv::gpu::PtrStepSzf, cv::gpu::PtrStepSzf, cv::gpu::PtrStepSzf, cv::gpu::PtrStepSzf, cv::gpu::PtrStepSzf, cv::gpu::PtrStepSzf, cv::gpu::PtrStepSzf, cv::gpu::PtrStepSzf, cv::gpu::PtrStepSzf, cv::gpu::PtrStepSzf, cv::gpu::PtrStepSzf, float, float)’ [-Wmissing-prototypes] /Users/michael/Documents/project/opencv/modules/gpu/src/cuda/tvl1flow.cu:320: warning: no previous prototype for ‘void tvl1flow::estimateDualVariables(cv::gpu::PtrStepSzf, cv::gpu::PtrStepSzf, cv::gpu::PtrStepSzf, cv::gpu::PtrStepSzf, cv::gpu::PtrStepSzf, cv::gpu::PtrStepSzf, float)’ [-Wmissing-prototypes] [ 74%] Building NVCC (Device) object modules/gpu/CMakeFiles/cuda_compile.dir/src/nvidia/core/./cuda_compile_generated_NCV.cu.o /Users/michael/Documents/project/opencv/modules/core/include/opencv2/core/mat.hpp(366): warning: integer conversion resulted in a change of sign

/Users/michael/Documents/project/opencv/modules/core/include/opencv2/core/mat.hpp(2135): warning: integer conversion resulted in a change of sign

/Users/michael/Documents/project/opencv/modules/core/include/opencv2/core/mat.hpp(366): warning: integer conversion resulted in a change of sign

/Users/michael/Documents/project/opencv/modules/core/include/opencv2/core/mat.hpp(2135): warning: integer conversion resulted in a change of sign

/Users/michael/Documents/project/opencv/modules/core/include/opencv2/core/mat.hpp(366): warning: integer conversion resulted in a change of sign

/Users/michael/Documents/project/opencv/modules/core/include/opencv2/core/mat.hpp(2135): warning: integer conversion resulted in a change of sign

/Users/michael/Documents/project/opencv/modules/core/include/opencv2/core/mat.hpp(366): warning: integer conversion resulted in a change of sign

/Users/michael/Documents/project/opencv/modules/core/include/opencv2/core/mat.hpp(2135): warning: integer conversion resulted in a change of sign

/Users/michael/Documents/project/opencv/modules/core/include/opencv2/core/mat.hpp(366): warning: integer conversion resulted in a change of sign

/Users/michael/Documents/project/opencv/modules/core/include/opencv2/core/mat.hpp(2135): warning: integer conversion resulted in a change of sign

/Users/michael/Documents/project/opencv/modules/core/include/opencv2/core/operations.hpp(2541): warning: integer conversion resulted in a change of sign

/Users/michael/Documents/project/opencv/modules/core/include/opencv2/core/mat.hpp(366): warning: integer conversion resulted in a change of sign

/Users/michael/Documents/project/opencv/modules/core/include/opencv2/core/mat.hpp(2135): warning: integer conversion resulted in a change of sign

/Users/michael/Documents/project/opencv/modules/core/include/opencv2/core/operations.hpp(2541): warning: integer conversion resulted in a change of sign

/Users/michael/Documents/project/opencv/modules/core/include/opencv2/core/mat.hpp(366): warning: integer conversion resulted in a change of sign

/Users/michael/Documents/project/opencv/modules/core/include/opencv2/core/mat.hpp(2135): warning: integer conversion resulted in a change of sign

/Users/michael/Documents/project/opencv/modules/core/include/opencv2/core/operations.hpp(2541): warning: integer conversion resulted in a change of sign

/Users/michael/Documents/project/opencv/modules/core/include/opencv2/core/mat.hpp(366): warning: integer conversion resulted in a change of sign

/Users/michael/Documents/project/opencv/modules/core/include/opencv2/core/mat.hpp(2135): warning: integer conversion resulted in a change of sign

/Users/michael/Documents/project/opencv/modules/core/include/opencv2/core/operations.hpp(2541): warning: integer conversion resulted in a change of sign

/Users/michael/Documents/project/opencv/modules/core/include/opencv2/core/mat.hpp(366): warning: integer conversion resulted in a change of sign

/Users/michael/Documents/project/opencv/modules/core/include/opencv2/core/mat.hpp(2135): warning: integer conversion resulted in a change of sign

/Users/michael/Documents/project/opencv/modules/core/include/opencv2/core/operations.hpp(2541): warning: integer conversion resulted in a change of sign

/Users/michael/Documents/project/opencv/modules/core/include/opencv2/core/mat.hpp(366): warning: integer conversion resulted in a change of sign

/Users/michael/Documents/project/opencv/modules/core/include/opencv2/core/mat.hpp(2135): warning: integer conversion resulted in a change of sign

/Users/michael/Documents/project/opencv/modules/gpu/src/nvidia/core/NCV.cu:586: warning: no previous prototype for ‘void _ncvQueryMoment(NcvTimeMoment)’ [-Wmissing-prototypes] /Users/michael/Documents/project/opencv/modules/gpu/src/nvidia/core/NCV.cu:592: warning: no previous prototype for ‘double _ncvMomentToMicroseconds(NcvTimeMoment)’ [-Wmissing-prototypes] /Users/michael/Documents/project/opencv/modules/gpu/src/nvidia/core/NCV.cu:598: warning: no previous prototype for ‘double _ncvMomentsDiffToMicroseconds(NcvTimeMoment, NcvTimeMoment)’ [-Wmissing-prototypes] /Users/michael/Documents/project/opencv/modules/gpu/src/nvidia/core/NCV.cu:603: warning: no previous prototype for ‘double _ncvMomentsDiffToMilliseconds(NcvTimeMoment, NcvTimeMoment)’ [-Wmissing-prototypes] [ 74%] Building NVCC (Device) object modules/gpu/CMakeFiles/cuda_compile.dir/src/nvidia/core/./cuda_compile_generated_NCVPyramid.cu.o /Users/michael/Documents/project/opencv/modules/core/include/opencv2/core/mat.hpp(366): warning: integer conversion resulted in a change of sign

/Users/michael/Documents/project/opencv/modules/core/include/opencv2/core/mat.hpp(2135): warning: integer conversion resulted in a change of sign

/Users/michael/Documents/project/opencv/modules/core/include/opencv2/core/mat.hpp(366): warning: integer conversion resulted in a change of sign

/Users/michael/Documents/project/opencv/modules/core/include/opencv2/core/mat.hpp(2135): warning: integer conversion resulted in a change of sign

/Users/michael/Documents/project/opencv/modules/core/include/opencv2/core/mat.hpp(366): warning: integer conversion resulted in a change of sign

/Users/michael/Documents/project/opencv/modules/core/include/opencv2/core/mat.hpp(2135): warning: integer conversion resulted in a change of sign

/Users/michael/Documents/project/opencv/modules/core/include/opencv2/core/mat.hpp(366): warning: integer conversion resulted in a change of sign

/Users/michael/Documents/project/opencv/modules/core/include/opencv2/core/mat.hpp(2135): warning: integer conversion resulted in a change of sign

/Users/michael/Documents/project/opencv/modules/core/include/opencv2/core/mat.hpp(366): warning: integer conversion resulted in a change of sign

/Users/michael/Documents/project/opencv/modules/core/include/opencv2/core/mat.hpp(2135): warning: integer conversion resulted in a change of sign

/Users/michael/Documents/project/opencv/modules/core/include/opencv2/core/operations.hpp(2541): warning: integer conversion resulted in a change of sign

/Users/michael/Documents/project/opencv/modules/core/include/opencv2/core/mat.hpp(366): warning: integer conversion resulted in a change of sign

/Users/michael/Documents/project/opencv/modules/core/include/opencv2/core/mat.hpp(2135): warning: integer conversion resulted in a change of sign

/Users/michael/Documents/project/opencv/modules/core/include/opencv2/core/operations.hpp(2541): warning: integer conversion resulted in a change of sign

/Users/michael/Documents/project/opencv/modules/core/include/opencv2/core/mat.hpp(366): warning: integer conversion resulted in a change of sign

/Users/michael/Documents/project/opencv/modules/core/include/opencv2/core/mat.hpp(2135): warning: integer conversion resulted in a change of sign

/Users/michael/Documents/project/opencv/modules/core/include/opencv2/core/operations.hpp(2541): warning: integer conversion resulted in a change of sign

/Users/michael/Documents/project/opencv/modules/core/include/opencv2/core/mat.hpp(366): warning: integer conversion resulted in a change of sign

/Users/michael/Documents/project/opencv/modules/core/include/opencv2/core/mat.hpp(2135): warning: integer conversion resulted in a change of sign

/Users/michael/Documents/project/opencv/modules/core/include/opencv2/core/operations.hpp(2541): warning: integer conversion resulted in a change of sign

/Users/michael/Documents/project/opencv/modules/core/include/opencv2/core/mat.hpp(366): warning: integer conversion resulted in a change of sign

/Users/michael/Documents/project/opencv/modules/core/include/opencv2/core/mat.hpp(2135): warning: integer conversion resulted in a change of sign

/Users/michael/Documents/project/opencv/modules/core/include/opencv2/core/operations.hpp(2541): warning: integer conversion resulted in a change of sign

/Users/michael/Documents/project/opencv/modules/core/include/opencv2/core/mat.hpp(366): warning: integer conversion resulted in a change of sign

/Users/michael/Documents/project/opencv/modules/core/include/opencv2/core/mat.hpp(2135): warning: integer conversion resulted in a change of sign

[ 74%] Building NVCC (Device) object modules/gpu/CMakeFiles/cuda_compile.dir/src/nvidia/./cuda_compile_generated_NCVBroxOpticalFlow.cu.o /Users/michael/Documents/project/opencv/modules/core/include/opencv2/core/mat.hpp(366): warning: integer conversion resulted in a change of sign

/Users/michael/Documents/project/opencv/modules/core/include/opencv2/core/mat.hpp(2135): warning: integer conversion resulted in a change of sign

/Users/michael/Documents/project/opencv/modules/core/include/opencv2/core/mat.hpp(366): warning: integer conversion resulted in a change of sign

/Users/michael/Documents/project/opencv/modules/core/include/opencv2/core/mat.hpp(2135): warning: integer conversion resulted in a change of sign

/Users/michael/Documents/project/opencv/modules/core/include/opencv2/core/mat.hpp(366): warning: integer conversion resulted in a change of sign

/Users/michael/Documents/project/opencv/modules/core/include/opencv2/core/mat.hpp(2135): warning: integer conversion resulted in a change of sign

/Users/michael/Documents/project/opencv/modules/core/include/opencv2/core/mat.hpp(366): warning: integer conversion resulted in a change of sign

/Users/michael/Documents/project/opencv/modules/core/include/opencv2/core/mat.hpp(2135): warning: integer conversion resulted in a change of sign

/Users/michael/Documents/project/opencv/modules/core/include/opencv2/core/mat.hpp(366): warning: integer conversion resulted in a change of sign

/Users/michael/Documents/project/opencv/modules/core/include/opencv2/core/mat.hpp(2135): warning: integer conversion resulted in a change of sign

/Users/michael/Documents/project/opencv/modules/core/include/opencv2/core/operations.hpp(2541): warning: integer conversion resulted in a change of sign

/Users/michael/Documents/project/opencv/modules/core/include/opencv2/core/mat.hpp(366): warning: integer conversion resulted in a change of sign

/Users/michael/Documents/project/opencv/modules/core/include/opencv2/core/mat.hpp(2135): warning: integer conversion resulted in a change of sign

/Users/michael/Documents/project/opencv/modules/core/include/opencv2/core/operations.hpp(2541): warning: integer conversion resulted in a change of sign

/Users/michael/Documents/project/opencv/modules/core/include/opencv2/core/mat.hpp(366): warning: integer conversion resulted in a change of sign

/Users/michael/Documents/project/opencv/modules/core/include/opencv2/core/mat.hpp(2135): warning: integer conversion resulted in a change of sign

/Users/michael/Documents/project/opencv/modules/core/include/opencv2/core/operations.hpp(2541): warning: integer conversion resulted in a change of sign

/Users/michael/Documents/project/opencv/modules/core/include/opencv2/core/mat.hpp(366): warning: integer conversion resulted in a change of sign

/Users/michael/Documents/project/opencv/modules/core/include/opencv2/core/mat.hpp(2135): warning: integer conversion resulted in a change of sign

/Users/michael/Documents/project/opencv/modules/core/include/opencv2/core/operations.hpp(2541): warning: integer conversion resulted in a change of sign

/Users/michael/Documents/project/opencv/modules/core/include/opencv2/core/mat.hpp(366): warning: integer conversion resulted in a change of sign

/Users/michael/Documents/project/opencv/modules/core/include/opencv2/core/mat.hpp(2135): warning: integer conversion resulted in a change of sign

/Users/michael/Documents/project/opencv/modules/core/include/opencv2/core/operations.hpp(2541): warning: integer conversion resulted in a change of sign

/Users/michael/Documents/project/opencv/modules/core/include/opencv2/core/mat.hpp(366): warning: integer conversion resulted in a change of sign

/Users/michael/Documents/project/opencv/modules/core/include/opencv2/core/mat.hpp(2135): warning: integer conversion resulted in a change of sign

/Users/michael/Documents/project/opencv/modules/gpu/src/nvidia/NCVBroxOpticalFlow.cu:629: warning: no previous prototype for ‘void initTexture1D(texture<float, 1,="" cudareadmodeelementtype="">&)’ [-Wmissing-prototypes] /Users/michael/Documents/project/opencv/modules/gpu/src/nvidia/NCVBroxOpticalFlow.cu:636: warning: no previous prototype for ‘void initTexture2D(texture<float, 2,="" cudareadmodeelementtype="">&)’ [-Wmissing-prototypes] /Users/michael/Documents/project/opencv/modules/gpu/src/nvidia/NCVBroxOpticalFlow.cu:644: warning: no previous prototype for ‘void InitTextures()’ [-Wmissing-prototypes] [ 74%] Building NVCC (Device) object modules/gpu/CMakeFiles/cuda_compile.dir/src/nvidia/./cuda_compile_generated_NCVHaarObjectDetection.cu.o /Users/michael/Documents/project/opencv/modules/core/include/opencv2/core/mat.hpp(366): warning: integer conversion resulted in a change of sign

/Users/michael/Documents/project/opencv/modules/core/include/opencv2/core/mat.hpp(2135): warning: integer conversion resulted in a change of sign

/Users/michael/Documents/project/opencv/modules/core/include/opencv2/core/mat.hpp(366): warning: integer conversion resulted in a change of sign

/Users/michael/Documents/project/opencv/modules/core/include/opencv2/core/mat.hpp(2135): warning: integer conversion resulted in a change of sign

/Users/michael/Documents/project/opencv/modules/core/include/opencv2/core/mat.hpp(366): warning: integer conversion resulted in a change of sign

/Users/michael/Documents/project/opencv/modules/core/include/opencv2/core/mat.hpp(2135): warning: integer conversion resulted in a change of sign

/Users/michael/Documents/project/opencv/modules/core/include/opencv2/core/mat.hpp(366): warning: integer conversion resulted in a change of sign

/Users/michael/Documents/project/opencv/modules/core/include/opencv2/core/mat.hpp(2135): warning: integer conversion resulted in a change of sign

/Users/michael/Documents/project/opencv/modules/core/include/opencv2/core/mat.hpp(366): warning: integer conversion resulted in a change of sign

/Users/michael/Documents/project/opencv/modules/core/include/opencv2/core/mat.hpp(2135): warning: integer conversion resulted in a change of sign

/Users/michael/Documents/project/opencv/modules/core/include/opencv2/core/operations.hpp(2541): warning: integer conversion resulted in a change of sign

/Users/michael/Documents/project/opencv/modules/core/include/opencv2/core/mat.hpp(366): warning: integer conversion resulted in a change of sign

/Users/michael/Documents/project/opencv/modules/core/include/opencv2/core/mat.hpp(2135): warning: integer conversion resulted in a change of sign

/Users/michael/Documents/project/opencv/modules/core/include/opencv2/core/operations.hpp(2541): warning: integer conversion resulted in a change of sign

/Users/michael/Documents/project/opencv/modules/core/include/opencv2/core/mat.hpp(366): warning: integer conversion resulted in a change of sign

/Users/michael/Documents/project/opencv/modules/core/include/opencv2/core/mat.hpp(2135): warning: integer conversion resulted in a change of sign

/Users/michael/Documents/project/opencv/modules/core/include/opencv2/core/operations.hpp(2541): warning: integer conversion resulted in a change of sign

/Users/michael/Documents/project/opencv/modules/core/include/opencv2/core/mat.hpp(366): warning: integer conversion resulted in a change of sign

/Users/michael/Documents/project/opencv/modules/core/include/opencv2/core/mat.hpp(2135): warning: integer conversion resulted in a change of sign

/Users/michael/Documents/project/opencv/modules/core/include/opencv2/core/operations.hpp(2541): warning: integer conversion resulted in a change of sign

/Users/michael/Documents/project/opencv/modules/core/include/opencv2/core/mat.hpp(366): warning: integer conversion resulted in a change of sign

/Users/michael/Documents/project/opencv/modules/core/include/opencv2/core/mat.hpp(2135): warning: integer conversion resulted in a change of sign

/Users/michael/Documents/project/opencv/modules/core/include/opencv2/core/operations.hpp(2541): warning: integer conversion resulted in a change of sign

/Users/michael/Documents/project/opencv/modules/core/include/opencv2/core/mat.hpp(366): warning: integer conversion resulted in a change of sign

/Users/michael/Documents/project/opencv/modules/core/include/opencv2/core/mat.hpp(2135): warning: integer conversion resulted in a change of sign

/Users/michael/Documents/project/opencv/modules/gpu/src/nvidia/NCVHaarObjectDetection.cu:85: warning: no previous prototype for ‘Ncv32u warpScanInclusive(Ncv32u, volatile Ncv32u)’ [-Wmissing-prototypes] /Users/michael/Documents/project/opencv/modules/gpu/src/nvidia/NCVHaarObjectDetection.cu:194: warning: no previous prototype for ‘HaarStage64 getStage(Ncv32u, HaarStage64)’ [-Wmissing-prototypes] /Users/michael/Documents/project/opencv/modules/gpu/src/nvidia/NCVHaarObjectDetection.cu:252: warning: no previous prototype for ‘void compactBlockWriteOutAnchorParallel(Ncv32u, Ncv32u, Ncv32u)’ [-Wmissing-prototypes] /Users/michael/Documents/project/opencv/modules/gpu/src/nvidia/NCVHaarObjectDetection.cu:743: warning: no previous prototype for ‘void applyHaarClassifierAnchorParallelDynTemplate(NcvBool, NcvBool, NcvBool, NcvBool, NcvBool, dim3, dim3, CUstream_st, Ncv32u, Ncv32u, Ncv32f, Ncv32u, HaarFeature64, HaarClassifierNode128, HaarStage64, Ncv32u, Ncv32u, Ncv32u, Ncv32u, NcvSize32u, Ncv32u, Ncv32u, Ncv32f)’ [-Wmissing-prototypes] /Users/michael/Documents/project/opencv/modules/gpu/src/nvidia/NCVHaarObjectDetection.cu:849: warning: no previous prototype for ‘void applyHaarClassifierClassifierParallelDynTemplate(NcvBool, NcvBool, NcvBool, dim3, dim3, CUstream_st, Ncv32u, Ncv32u, Ncv32f, Ncv32u, HaarFeature64, HaarClassifierNode128, HaarStage64, Ncv32u, Ncv32u, Ncv32u, Ncv32u, NcvSize32u, Ncv32u, Ncv32u, Ncv32f)’ [-Wmissing-prototypes] /Users/michael/Documents/project/opencv/modules/gpu/src/nvidia/NCVHaarObjectDetection.cu:920: warning: no previous prototype for ‘void initializeMaskVectorDynTemplate(NcvBool, NcvBool, dim3, dim3, CUstream_st, Ncv32u, Ncv32u, Ncv32u, Ncv32u, NcvSize32u, Ncv32u)’ [-Wmissing-prototypes] /Users/michael/Documents/project/opencv/modules/gpu/src/nvidia/NCVHaarObjectDetection.cu:936: warning: no previous prototype for ‘Ncv32u getStageNumWithNotLessThanNclassifiers(Ncv32u, HaarClassifierCascadeDescriptor&, NCVVector<haarstage64>&)’ [-Wmissing-prototypes] /Users/michael/Documents/project/opencv/modules/gpu/src/nvidia/NCVHaarObjectDetection.cu:1451: warning: no previous prototype for ‘NcvRect32u pixelToRect(Ncv32u, Ncv32u, Ncv32u, Ncv32f)’ [-Wmissing-prototypes] /Users/michael/Documents/project/opencv/modules/gpu/src/cuda/warp.cu:111: warning: no previous prototype for ‘void cv::gpu::device::imgproc::buildWarpAffineMaps_gpu(float, cv::gpu::PtrStepSzf, cv::gpu::PtrStepSzf, CUstream_st)’ [-Wmissing-prototypes] /Users/michael/Documents/project/opencv/modules/gpu/src/cuda/warp.cu:118: warning: no previous prototype for ‘void cv::gpu::device::imgproc::buildWarpPerspectiveMaps_gpu(float, cv::gpu::PtrStepSzf, cv::gpu::PtrStepSzf, CUstream_st)’ [-Wmissing-prototypes] Scanning dependencies of target opencv_gpu [ 74%] [ 74%] [ 74%] [ 74%] Building CXX object modules/gpu/CMakeFiles/opencv_gpu.dir/src/arithm.cpp.o Building CXX object modules/gpu/CMakeFiles/opencv_gpu.dir/src/bgfg_gmg.cpp.o Building CXX object modules/gpu/CMakeFiles/opencv_gpu.dir/src/bgfg_mog.cpp.o Building CXX object modules/gpu/CMakeFiles/opencv_gpu.dir/src/bilateral_filter.cpp.o [ 74%] Building CXX object modules/gpu/CMakeFiles/opencv_gpu.dir/src/blend.cpp.o [ 74%] [ 74%] Building CXX object modules/gpu/CMakeFiles/opencv_gpu.dir/src/calib3d.cpp.o Building CXX object modules/gpu/CMakeFiles/opencv_gpu.dir/src/brute_force_matcher.cpp.o [ 74%] Building CXX object modules/gpu/CMakeFiles/opencv_gpu.dir/src/cascadeclassifier.cpp.o [ 74%] Building CXX object modules/gpu/CMakeFiles/opencv_gpu.dir/src/color.cpp.o /Users/michael/Documents/project/opencv/modules/gpu/src/cascadeclassifier.cpp:286: warning: no previous prototype for ‘cv::Size operator-(const cv::Size&, const cv::Size&)’ [-Wmissing-prototypes] /Users/michael/Documents/project/opencv/modules/gpu/src/cascadeclassifier.cpp:291: warning: no previous prototype for ‘cv::Size operator+(const cv::Size&, const int&)’ [-Wmissing-prototypes] /Users/michael/Documents/project/opencv/modules/gpu/src/cascadeclassifier.cpp:296: warning: no previous prototype for ‘cv::Size operator(const cv::Size&, const float&)’ [-Wmissing-prototypes] /Users/michael/Documents/project/opencv/modules/gpu/src/cascadeclassifier.cpp:301: warning: no previous prototype for ‘cv::Size operator/(const cv::Size&, const float&)’ [-Wmissing-prototypes] /Users/michael/Documents/project/opencv/modules/gpu/src/cascadeclassifier.cpp:306: warning: no previous prototype for ‘bool operator<=(const cv::Size&, const cv::Size&)’ [-Wmissing-prototypes] /Users/michael/Documents/project/opencv/modules/gpu/src/cascadeclassifier.cpp:743: warning: no previous prototype for ‘void groupRectangles(std::vector<ncvrect32u, std::allocator<ncvrect32u=""> >&, int, double, std::vector<unsigned int,="" std::allocator<unsigned="" int=""> >)’ [-Wmissing-prototypes] /Users/michael/Documents/project/opencv/modules/gpu/src/cascadeclassifier.cpp:766: warning: no previous prototype for ‘NCVStatus loadFromXML(const cv::String&, HaarClassifierCascadeDescriptor&, std::vector<haarstage64, std::allocator<haarstage64=""> >&, std::vector<haarclassifiernode128, std::allocator<haarclassifiernode128=""> >&, std::vector<haarfeature64, std::allocator<haarfeature64=""> >&)’ [-Wmissing-prototypes] [ 75%] Building CXX object modules/gpu/CMakeFiles/opencv_gpu.dir/src/cu_safe_call.cpp.o [ 75%] Building CXX object modules/gpu/CMakeFiles/opencv_gpu.dir/src/cuvid_video_source.cpp.o [ 75%] Building CXX object modules/gpu/CMakeFiles/opencv_gpu.dir/src/denoising.cpp.o [ 75%] Building CXX object modules/gpu/CMakeFiles/opencv_gpu.dir/src/element_operations.cpp.o [ 75%] Building CXX object modules/gpu/CMakeFiles/opencv_gpu.dir/src/error.cpp.o [ 75%] Building CXX object modules/gpu/CMakeFiles/opencv_gpu.dir/src/fast.cpp.o [ 75%] Building CXX object modules/gpu/CMakeFiles/opencv_gpu.dir/src/ffmpeg_video_source.cpp.o /Users/michael/Documents/project/opencv/modules/gpu/src/element_operations.cpp:1796: error: ‘uint’ was not declared in this scope /Users/michael/Documents/project/opencv/modules/gpu/src/element_operations.cpp:1796: error: template argument 1 is invalid /Users/michael/Documents/project/opencv/modules/gpu/src/element_operations.cpp:1796: error: ‘uint’ was not declared in this scope /Users/michael/Documents/project/opencv/modules/gpu/src/element_operations.cpp:1796: error: template argument 1 is invalid /Users/michael/Documents/project/opencv/modules/gpu/src/element_operations.cpp:1796: error: ‘uint’ was not declared in this scope /Users/michael/Documents/project/opencv/modules/gpu/src/element_operations.cpp:1796: error: template argument 1 is invalid /Users/michael/Documents/project/opencv/modules/gpu/src/element_operations.cpp:1797: error: ‘uint’ was not declared in this scope /Users/michael/Documents/project/opencv/modules/gpu/src/element_operations.cpp:1797: error: template argument 1 is invalid /Users/michael/Documents/project/opencv/modules/gpu/src/element_operations.cpp:1797: error: ‘uint’ was not declared in this scope /Users/michael/Documents/project/opencv/modules/gpu/src/element_operations.cpp:1797: error: template argument 1 is invalid /Users/michael/Documents/project/opencv/modules/gpu/src/element_operations.cpp:1797: error: ‘uint’ was not declared in this scope /Users/michael/Documents/project/opencv/modules/gpu/src/element_operations.cpp:1797: error: template argument 1 is invalid /Users/michael/Documents/project/opencv/modules/gpu/src/element_operations.cpp:1798: error: ‘uint’ was not declared in this scope /Users/michael/Documents/project/opencv/modules/gpu/src/element_operations.cpp:1798: error: template argument 1 is invalid /Users/michael/Documents/project/opencv/modules/gpu/src/element_operations.cpp:1798: error: ‘uint’ was not declared in this scope /Users/michael/Documents/project/opencv/modules/gpu/src/element_operations.cpp:1798: error: template argument 1 is invalid /Users/michael/Documents/project/opencv/modules/gpu/src/element_operations.cpp:1798: error: ‘uint’ was not declared in this scope /Users/michael/Documents/project/opencv/modules/gpu/src/element_operations.cpp:1798: error: template argument 1 is invalid /Users/michael/Documents/project/opencv/modules/gpu/src/element_operations.cpp:1799: error: ‘uint’ was not declared in this scope /Users/michael/Documents/project/opencv/modules/gpu/src/element_operations.cpp:1799: error: template argument 1 is invalid /Users/michael/Documents/project/opencv/modules/gpu/src/element_operations.cpp:1799: error: ‘uint’ was not declared in this scope /Users/michael/Documents/project/opencv/modules/gpu/src/element_operations.cpp:1799: error: template argument 1 is invalid /Users/michael/Documents/project/opencv/modules/gpu/src/element_operations.cpp:1799: error: ‘uint’ was not declared in this scope /Users/michael/Documents/project/opencv/modules/gpu/src/element_operations.cpp:1799: error: template argument 1 is invalid /Users/michael/Documents/project/opencv/modules/gpu/src/element_operations.cpp: In function ‘void cv::gpu::compare(const cv::gpu::GpuMat&, const cv::gpu::GpuMat&, cv::gpu::GpuMat&, int, cv::gpu::Stream&)’: /Users/michael/Documents/project/opencv/modules/gpu/src/element_operations.cpp:1823: error: ‘uint’ was not declared in this scope /Users/michael/Documents/project/opencv/modules/gpu/src/element_operations.cpp:1823: error: template argument 1 is invalid /Users/michael/Documents/project/opencv/modules/gpu/src/element_operations.cpp:1823: error: ‘uint’ cannot appear in a constant-expression /Users/michael/Documents/project/opencv/modules/gpu/src/element_operations.cpp:1823: error: template argument 1 is invalid /Users/michael/Documents/project/opencv/modules/gpu/src/element_operations.cpp:1823: error: ‘uint’ cannot appear in a constant-expression /Users/michael/Documents/project/opencv/modules/gpu/src/element_operations.cpp:1823: error: template argument 1 is invalid /Users/michael/Documents/project/opencv/modules/gpu/src/element_operations.cpp:1879: error: invalid conversion from ‘unsigned int’ to ‘int’ /Users/michael/Documents/project/opencv/modules/gpu/src/element_operations.cpp:1879: error: invalid conversion from ‘unsigned int’ to ‘int’ /Users/michael/Documents/project/opencv/modules/gpu/src/element_operations.cpp:1879: error: invalid conversion from ‘unsigned int’ to ‘int’ make[2]: [modules/gpu/CMakeFiles/opencv_gpu.dir/src/element_operations.cpp.o] Error 1 make[2]: Waiting for unfinished jobs.... make[1]: [modules/gpu/CMakeFiles/opencv_gpu.dir/all] Error 2 make: * [all] Error 2